develooper Front page | perl.perl5.porters | Postings from February 2008

Smoke [5.11.0] 33323 FAIL(F) MSWin32 WinXP/.Net SP2 (x86/2 cpu)

From:
Steve Hay
Date:
February 16, 2008 19:45
Subject:
Smoke [5.11.0] 33323 FAIL(F) MSWin32 WinXP/.Net SP2 (x86/2 cpu)
Message ID:
UKMAIL02FRaqbC8wSA100000031@ukmail02.planit.group
Automated smoke report for 5.11.0 patch 33323
maldoror.bath.planit.group: Intel(R) Core(TM)2 CPU 6700 @ 2.66GHz(~2660 MHz) (x86/2 cpu)
    on        MSWin32 - WinXP/.Net SP2
    using     bcc32 version 5.5.1
    smoketime 5 hours 10 minutes (average 15 minutes 30 seconds)

Summary: FAIL(F)

O = OK  F = Failure(s), extended report at the bottom
X = Failure(s) under TEST but not under harness
? = still running or test results not (yet) available
Build failures during:       - = unknown or N/A
c = Configure, m = make, M = make (after miniperl), t = make test-prep

   33323     Configuration (common) -DCCTYPE=BORLAND -DINST_TOP=$(INST_DRV)\Smoke\doesntexist
----------- ---------------------------------------------------------
F F         
F F         -Dusemymalloc
F F         -Duselargefiles
F F         -Duselargefiles -Dusemymalloc
F F         -Duseithreads -Uuseimpsys
F F         -Duseithreads -Uuseimpsys -Dusemymalloc
F F         -Duseithreads -Uuseimpsys -Duselargefiles
F F         -Duseithreads -Uuseimpsys -Duselargefiles -Dusemymalloc
F F         -Duseithreads
F F         -Duseithreads -Duselargefiles
| +--------- -DDEBUGGING
+----------- no debugging


Locally applied patches:
    DEVEL
    SMOKE33323

Failures: (common-args) -DCCTYPE=BORLAND -DINST_TOP=$(INST_DRV)\Smoke\doesntexist
[default] 
[default] -DDEBUGGING
[default] -Dusemymalloc
[default] -DDEBUGGING -Dusemymalloc
[default] -Duselargefiles
[default] -DDEBUGGING -Duselargefiles
[default] -Duselargefiles -Dusemymalloc
[default] -DDEBUGGING -Duselargefiles -Dusemymalloc
[default] -Duseithreads -Uuseimpsys -Dusemymalloc
../lib/ExtUtils/CBuilder/t/01-basic.t.......................FAILED
    9-11
../lib/Module/Build/t/compat.t..............................FAILED
    115

[default] -Duseithreads -Uuseimpsys
[default] -DDEBUGGING -Duseithreads -Uuseimpsys
[default] -DDEBUGGING -Duseithreads -Uuseimpsys -Dusemymalloc
[default] -Duseithreads -Uuseimpsys -Duselargefiles
[default] -DDEBUGGING -Duseithreads -Uuseimpsys -Duselargefiles
[default] -Duseithreads -Uuseimpsys -Duselargefiles -Dusemymalloc
[default] -DDEBUGGING -Duseithreads -Uuseimpsys -Duselargefiles -Dusemymalloc
[default] -Duseithreads
[default] -DDEBUGGING -Duseithreads
[default] -Duseithreads -Duselargefiles
../ext/threads/shared/t/stress.t............................FAILED
../lib/ExtUtils/CBuilder/t/01-basic.t.......................FAILED
    9-11
../lib/Module/Build/t/compat.t..............................FAILED
    115

[default] -DDEBUGGING -Duseithreads -Duselargefiles
../ext/IO/t/io_multihomed.t.................................FAILED
../ext/threads/shared/t/stress.t............................FAILED
../lib/ExtUtils/CBuilder/t/01-basic.t.......................FAILED
    9-11
../lib/Module/Build/t/compat.t..............................FAILED
    115

Compiler messages(bcc32):
Warning W8071 ..\generate_uudmap.c 17: Conversion may lose significant digits in function main
Warning W8013 ..\perly.c 270: Possible use of 'i' before definition in function S_clear_yystack
Warning W8013 ..\regcomp.c 4424: Possible use of 'copyRExC_state' before definition in function Perl_re_compile
Warning W8065 win32.c 1681: Call to function 'out_of_memory' with no prototype in function win32_ansipath
Warning W8065 win32.c 1690: Call to function 'out_of_memory' with no prototype in function win32_ansipath
Warning W8065 win32.c 1697: Call to function 'out_of_memory' with no prototype in function win32_ansipath
Warning W8065 win32.c 4980: Call to function 'win32_create_message_window_class' with no prototype in function win32_create_message_window
Warning W8065 win32.c 4807: Call to function 'PerlIO_teardown' with no prototype in function Perl_win32_term
Warning W8055 win32io.c 259: Possible overflow in shift operation in function PerlIOWin32_seek
Warning W8055 win32io.c 280: Possible overflow in shift operation in function PerlIOWin32_tell
Warning W8008 crc32.c 232: Condition is always true in function crc32
Warning W8066 crc32.c 242: Unreachable code in function crc32
Warning W8004 deflate.c 351: 'hash_head' is assigned a value that is never used in function deflateSetDictionary
Warning W8008 deflate.c 1278: Condition is always false in function fill_window
Warning W8066 deflate.c 1279: Unreachable code in function fill_window
Warning W8004 deflate.c 1669: 'bflush' is assigned a value that is never used in function deflate_slow
Warning W8065 Piece.xs 762: Call to function '_alloca' with no prototype in function _strptime
Warning W8064 Win32.xs 441: Call to function with no prototype in function w32_IsAdminUser
Warning W8055 win32.c 2938: Possible overflow in shift operation in function win32_fstat
Warning W8079 perlhost.h 624: Mixing pointers to different 'char' types in function PerlStdIOGetBase(IPerlStdIO *,FILE *)
Warning W8079 perlhost.h 657: Mixing pointers to different 'char' types in function PerlStdIOGetPtr(IPerlStdIO *,FILE *)
Warning W8079 perlhost.h 749: Mixing pointers to different 'char' types in function PerlStdIOSetPtr(IPerlStdIO *,FILE *,char *)
Warning W8079 ..\perlio.c 3399: Mixing pointers to different 'char' types in function PerlIOStdio_set_ptrcnt

-- 
Report by Test::Smoke v1.29_60 build 1155 running on perl 5.9.5
(Reporter v0.032 / Smoker v0.038)




nntp.perl.org: Perl Programming lists via nntp and http.
Comments to Ask Bjørn Hansen at ask@perl.org | Group listing | About