develooper Front page | perl.perl5.porters | Postings from January 2008

Smoke [5.11.0] 32806 FAIL(M) MSWin32 WinXP/.Net SP2 (x86/2 cpu)

From:
Steve Hay
Date:
January 2, 2008 17:17
Subject:
Smoke [5.11.0] 32806 FAIL(M) MSWin32 WinXP/.Net SP2 (x86/2 cpu)
Message ID:
UKMAIL02rwiZ9rWjAKY000002d3@ukmail02.planit.group
Automated smoke report for 5.11.0 patch 32806
maldoror.bath.planit.group: Intel(R) Core(TM)2 CPU 6700 @ 2.66GHz(~2660 MHz) (x86/2 cpu)
    on        MSWin32 - WinXP/.Net SP2
    using     cl version 12.00.8804
    smoketime 1 hour 41 minutes (average 5 minutes 4 seconds)

Summary: FAIL(M)

O = OK  F = Failure(s), extended report at the bottom
X = Failure(s) under TEST but not under harness
? = still running or test results not (yet) available
Build failures during:       - = unknown or N/A
c = Configure, m = make, M = make (after miniperl), t = make test-prep

   32806     Configuration (common) -DINST_TOP=$(INST_DRV)\Smoke\doesntexist
----------- ---------------------------------------------------------
M M         
M M         -Dusemymalloc
? ?         -Duseithreads -Uuseimpsys
? ?         -Duseithreads -Uuseimpsys -Dusemymalloc
? ?         -Duseithreads
M M         -Accflags='-DPERL_OLD_COPY_ON_WRITE'
M M         -Accflags='-DPERL_OLD_COPY_ON_WRITE' -Dusemymalloc
M M         -Accflags='-DPERL_OLD_COPY_ON_WRITE' -Duseithreads -Uuseimpsys
M M         -Accflags='-DPERL_OLD_COPY_ON_WRITE' -Duseithreads -Uuseimpsys -Dusemymalloc
M M         -Accflags='-DPERL_OLD_COPY_ON_WRITE' -Duseithreads
| +--------- -DDEBUGGING
+----------- no debugging

Locally applied patches:
    DEVEL
    SMOKE32806

Compiler messages(MSWin32):
..\pp_ctl.c(133) : warning C4018: '!=' : signed/unsigned mismatch
perldll.def : error LNK2001: unresolved external symbol Perl_re_dup_guts
..\perl511.lib : fatal error LNK1120: 1 unresolved externals
LINK : fatal error LNK1141: failure during build of exports file
..\pp_ctl.c(333) : error C2039: 'saved_copy' : is not a member of 'sv'
..\pp_ctl.c(334) : error C2039: 'saved_copy' : is not a member of 'sv'
..\pp_ctl.c(354) : error C2039: 'saved_copy' : is not a member of 'sv'
..\pp_ctl.c(354) : warning C4047: 'function' : 'struct sv *' differs in levels of indirection from 'const int '
..\pp_ctl.c(354) : warning C4024: 'Perl_sv_force_normal_flags' : different types for formal and actual parameter 1
..\pp_ctl.c(354) : error C2198: 'Perl_sv_force_normal_flags' : too few actual parameters
..\pp_ctl.c(359) : error C2039: 'saved_copy' : is not a member of 'sv'
..\pp_ctl.c(360) : error C2039: 'saved_copy' : is not a member of 'sv'
..\pp_ctl.c(360) : error C2198: 'Perl_sv_free' : too few actual parameters
..\pp_ctl.c(361) : error C2039: 'saved_copy' : is not a member of 'sv'
..\pp_ctl.c(354) : warning C4024: 'Perl_sv_force_normal_flags' : different types for formal and actual parameter 2

-- 
Report by Test::Smoke v1.20.07 build 1123 running on perl 5.9.5
(Reporter v0.029 / Smoker v0.036)




nntp.perl.org: Perl Programming lists via nntp and http.
Comments to Ask Bjørn Hansen at ask@perl.org | Group listing | About