develooper Front page | perl.perl5.porters | Postings from October 2007

Smoke [5.10.0] 32184 FAIL(F) freebsd 6.0-STABLE (i386/6 cpu)

From:
david
Date:
October 27, 2007 09:25
Subject:
Smoke [5.10.0] 32184 FAIL(F) freebsd 6.0-STABLE (i386/6 cpu)
Message ID:
20071027162517.2567B2E052@profane.mongueurs.net
Automated smoke report for 5.10.0 patch 32184
profane.mongueurs.net: Intel Pentium III Xeon (i386/6 cpu)
    on        freebsd - 6.0-STABLE
    using     cc version 3.4.4 [FreeBSD] 20050518
    smoketime 3 days 6 hours 36 minutes (average 1 hour 5 minutes)

Summary: FAIL(F)

O = OK  F = Failure(s), extended report at the bottom
X = Failure(s) under TEST but not under harness
? = still running or test results not (yet) available
Build failures during:       - = unknown or N/A
c = Configure, m = make, M = make (after miniperl), t = make test-prep

   32184     Configuration (common) none
----------- ---------------------------------------------------------
O O O O     
O O O O     -DNO_MATHOMS
O O O O     -Doptimize='-Os'
O O O O     -Doptimize='-Os' -DNO_MATHOMS
O O O O     -Doptimize='-O3 -fomit-frame-pointer -fno-strict-aliasing -pipe'
O O O O     -Doptimize='-O3 -fomit-frame-pointer -fno-strict-aliasing -pipe' -DNO_MATHOMS
O O O O     -Duseithreads
O O O O     -Duseithreads -DNO_MATHOMS
O O O O     -Duseithreads -Doptimize='-Os'
O O O O     -Duseithreads -Doptimize='-Os' -DNO_MATHOMS
O O O O     -Duseithreads -Doptimize='-O3 -fomit-frame-pointer -fno-strict-aliasing -pipe'
O O O O     -Duseithreads -Doptimize='-O3 -fomit-frame-pointer -fno-strict-aliasing -pipe' -DNO_MATHOMS
O O O O     -Duse64bitint
O O O O     -Duse64bitint -DNO_MATHOMS
O O O O     -Duse64bitint -Doptimize='-Os'
O O O O     -Duse64bitint -Doptimize='-Os' -DNO_MATHOMS
O O O O     -Duse64bitint -Doptimize='-O3 -fomit-frame-pointer -fno-strict-aliasing -pipe'
O O O O     -Duse64bitint -Doptimize='-O3 -fomit-frame-pointer -fno-strict-aliasing -pipe' -DNO_MATHOMS
O O O O     -Duse64bitint -Duseithreads
O O O O     -Duse64bitint -Duseithreads -DNO_MATHOMS
O O O O     -Duse64bitint -Duseithreads -Doptimize='-Os'
O O O O     -Duse64bitint -Duseithreads -Doptimize='-Os' -DNO_MATHOMS
O O O O     -Duse64bitint -Duseithreads -Doptimize='-O3 -fomit-frame-pointer -fno-strict-aliasing -pipe'
O O O O     -Duse64bitint -Duseithreads -Doptimize='-O3 -fomit-frame-pointer -fno-strict-aliasing -pipe' -DNO_MATHOMS
O O O F     -Dusemymalloc
F F F F     -Dusemymalloc -DNO_MATHOMS
F F F F     -Dusemymalloc -Doptimize='-Os'
F F F F     -Dusemymalloc -Doptimize='-Os' -DNO_MATHOMS
F F F F     -Dusemymalloc -Doptimize='-O3 -fomit-frame-pointer -fno-strict-aliasing -pipe'
F F F F     -Dusemymalloc -Doptimize='-O3 -fomit-frame-pointer -fno-strict-aliasing -pipe' -DNO_MATHOMS
F F F F     -Dusemymalloc -Duseithreads
F F F F     -Dusemymalloc -Duseithreads -DNO_MATHOMS
F F F F     -Dusemymalloc -Duseithreads -Doptimize='-Os'
F F F F     -Dusemymalloc -Duseithreads -Doptimize='-Os' -DNO_MATHOMS
F F F F     -Dusemymalloc -Duseithreads -Doptimize='-O3 -fomit-frame-pointer -fno-strict-aliasing -pipe'
F F F F     -Dusemymalloc -Duseithreads -Doptimize='-O3 -fomit-frame-pointer -fno-strict-aliasing -pipe' -DNO_MATHOMS
| | | +----- PERLIO = perlio -DDEBUGGING
| | +------- PERLIO = stdio  -DDEBUGGING
| +--------- PERLIO = perlio
+----------- PERLIO = stdio

Locally applied patches:
    DEVEL
    SMOKE32184

Failures: (common-args) none
[perlio] -DDEBUGGING -Dusemymalloc
[stdio/perlio] -Dusemymalloc -DNO_MATHOMS
[stdio/perlio] -DDEBUGGING -Dusemymalloc -DNO_MATHOMS
[stdio/perlio] -Dusemymalloc -Doptimize='-Os'
[stdio/perlio] -DDEBUGGING -Dusemymalloc -Doptimize='-Os'
[stdio/perlio] -Dusemymalloc -Doptimize='-Os' -DNO_MATHOMS
[stdio/perlio] -DDEBUGGING -Dusemymalloc -Doptimize='-Os' -DNO_MATHOMS
[stdio/perlio] -Dusemymalloc -Doptimize='-O3 -fomit-frame-pointer -fno-strict-aliasing -pipe'
[stdio/perlio] -DDEBUGGING -Dusemymalloc -Doptimize='-O3 -fomit-frame-pointer -fno-strict-aliasing -pipe'
[stdio/perlio] -Dusemymalloc -Doptimize='-O3 -fomit-frame-pointer -fno-strict-aliasing -pipe' -DNO_MATHOMS
[stdio/perlio] -DDEBUGGING -Dusemymalloc -Doptimize='-O3 -fomit-frame-pointer -fno-strict-aliasing -pipe' -DNO_MATHOMS
    ../lib/CPANPLUS/t/20_CPANPLUS-Dist-MM.t.FAILED ??
    ../lib/IPC/Cmd/t/01_IPC-Cmd.t...........FAILED ??
    ../t/io/dup.t...........................FAILED 15-16
    ../t/io/open.t..........................FAILED 93
Inconsistent test results (between TEST and harness):
    ../lib/CPANPLUS/Dist/Build/t/02_CPANPLUS-Dist-Build.tFAILED--non-zero wait status: 65280
    ../lib/Archive/Extract/t/01_Archive-Extract.tFAILED--non-zero wait status: 65280

[stdio] -Dusemymalloc -Duseithreads
    ../ext/threads/shared/t/stress.t........FAILED 1
    ../lib/CPANPLUS/t/20_CPANPLUS-Dist-MM.t.FAILED ??
    ../lib/IPC/Cmd/t/01_IPC-Cmd.t...........FAILED ??
    ../t/io/dup.t...........................FAILED 15-16
    ../t/io/open.t..........................FAILED 93
    ../t/op/threads.t.......................FAILED 10
Inconsistent test results (between TEST and harness):
    ../lib/CPANPLUS/Dist/Build/t/02_CPANPLUS-Dist-Build.tFAILED--non-zero wait status: 65280
    ../ext/threads/t/stress_re.t............FAILED--expected 61 tests, saw 17
    ../lib/Archive/Extract/t/01_Archive-Extract.tFAILED--non-zero wait status: 65280

[perlio] -Dusemymalloc -Duseithreads
    ../ext/threads/shared/t/stress.t........FAILED 1
    ../ext/threads/t/free2.t................FAILED 2-78
    ../lib/CPANPLUS/t/20_CPANPLUS-Dist-MM.t.FAILED ??
    ../lib/IPC/Cmd/t/01_IPC-Cmd.t...........FAILED ??
    ../t/io/dup.t...........................FAILED 15-16
    ../t/io/open.t..........................FAILED 93
    ../t/op/threads.t.......................FAILED 10
Inconsistent test results (between TEST and harness):
    ../lib/Test/Simple/t/is_deeply_with_threads.tFAILED--expected 505 tests, saw 0
    ../lib/CPANPLUS/Dist/Build/t/02_CPANPLUS-Dist-Build.tFAILED--non-zero wait status: 65280
    ../ext/threads/t/stress_string.t........FAILED--expected 61 tests, saw 10
    ../lib/Archive/Extract/t/01_Archive-Extract.tFAILED--non-zero wait status: 65280

[stdio] -DDEBUGGING -Dusemymalloc -Duseithreads
    ../ext/threads/t/free2.t................FAILED 2-78
    ../lib/CPANPLUS/t/20_CPANPLUS-Dist-MM.t.FAILED ??
    ../lib/IPC/Cmd/t/01_IPC-Cmd.t...........FAILED ??
    ../t/io/dup.t...........................FAILED 15-16
    ../t/io/open.t..........................FAILED 93
    ../t/op/threads.t.......................FAILED 10
Inconsistent test results (between TEST and harness):
    ../lib/CPANPLUS/Dist/Build/t/02_CPANPLUS-Dist-Build.tFAILED--non-zero wait status: 65280
    ../ext/threads/t/free.t.................FAILED--expected 29 tests, saw 1
    ../lib/Archive/Extract/t/01_Archive-Extract.tFAILED--non-zero wait status: 65280
    ../ext/threads/t/stress_cv.t............FAILED--expected 61 tests, saw 8

[perlio] -DDEBUGGING -Dusemymalloc -Duseithreads
[stdio] -DDEBUGGING -Dusemymalloc -Duseithreads -Doptimize='-Os' -DNO_MATHOMS
[stdio/perlio] -DDEBUGGING -Dusemymalloc -Duseithreads -Doptimize='-O3 -fomit-frame-pointer -fno-strict-aliasing -pipe'
    ../ext/threads/shared/t/stress.t........FAILED 1
    ../lib/CPANPLUS/t/20_CPANPLUS-Dist-MM.t.FAILED ??
    ../lib/IPC/Cmd/t/01_IPC-Cmd.t...........FAILED ??
    ../t/io/dup.t...........................FAILED 15-16
    ../t/io/open.t..........................FAILED 93
    ../t/op/threads.t.......................FAILED 10
Inconsistent test results (between TEST and harness):
    ../lib/CPANPLUS/Dist/Build/t/02_CPANPLUS-Dist-Build.tFAILED--non-zero wait status: 65280
    ../ext/threads/t/free2.t................FAILED--expected 78 tests, saw 1
    ../lib/Archive/Extract/t/01_Archive-Extract.tFAILED--non-zero wait status: 65280

[stdio] -Dusemymalloc -Duseithreads -DNO_MATHOMS
    ../ext/threads/shared/t/stress.t........FAILED 1
    ../lib/CPANPLUS/t/20_CPANPLUS-Dist-MM.t.FAILED ??
    ../lib/IPC/Cmd/t/01_IPC-Cmd.t...........FAILED ??
    ../t/io/dup.t...........................FAILED 15-16
    ../t/io/open.t..........................FAILED 93
    ../t/op/reset.t.........................FAILED 21-22
    ../t/op/threads.t.......................FAILED 10
Inconsistent test results (between TEST and harness):
    ../lib/Test/Simple/t/is_deeply_with_threads.tFAILED--expected 505 tests, saw 1
    ../lib/CPANPLUS/Dist/Build/t/02_CPANPLUS-Dist-Build.tFAILED--non-zero wait status: 65280
    ../lib/Archive/Extract/t/01_Archive-Extract.tFAILED--non-zero wait status: 65280

[perlio] -Dusemymalloc -Duseithreads -DNO_MATHOMS
    ../ext/threads/shared/t/stress.t........FAILED 1
    ../lib/CPANPLUS/t/20_CPANPLUS-Dist-MM.t.FAILED ??
    ../lib/IPC/Cmd/t/01_IPC-Cmd.t...........FAILED ??
    ../t/io/dup.t...........................FAILED 15-16
    ../t/io/open.t..........................FAILED 93
    ../t/op/threads.t.......................FAILED 10
Inconsistent test results (between TEST and harness):
    ../lib/Test/Simple/t/is_deeply_with_threads.tFAILED--expected 505 tests, saw 0
    ../lib/CPANPLUS/Dist/Build/t/02_CPANPLUS-Dist-Build.tFAILED--non-zero wait status: 65280
    ../ext/threads/t/free.t.................FAILED--expected 29 tests, saw 1
    ../lib/Archive/Extract/t/01_Archive-Extract.tFAILED--non-zero wait status: 65280

[stdio] -DDEBUGGING -Dusemymalloc -Duseithreads -DNO_MATHOMS
    ../lib/CPANPLUS/t/20_CPANPLUS-Dist-MM.t.FAILED ??
    ../lib/IPC/Cmd/t/01_IPC-Cmd.t...........FAILED ??
    ../t/io/dup.t...........................FAILED 15-16
    ../t/io/open.t..........................FAILED 93
    ../t/op/reset.t.........................FAILED 22
    ../t/op/threads.t.......................FAILED 10
Inconsistent test results (between TEST and harness):
    ../lib/CPANPLUS/Dist/Build/t/02_CPANPLUS-Dist-Build.tFAILED--non-zero wait status: 65280
    ../ext/threads/shared/t/stress.t........FAILED--expected 1 tests, saw 0
    ../ext/threads/t/free2.t................FAILED--expected 78 tests, saw 1
    ../ext/threads/t/stress_re.t............FAILED--expected 61 tests, saw 23
    ../lib/Archive/Extract/t/01_Archive-Extract.tFAILED--non-zero wait status: 65280
    ../ext/threads/t/stress_cv.t............FAILED--expected 61 tests, saw 13

[perlio] -DDEBUGGING -Dusemymalloc -Duseithreads -DNO_MATHOMS
    ../ext/threads/shared/t/stress.t........FAILED 1
    ../ext/threads/t/free2.t................FAILED 2-78
    ../lib/CPANPLUS/t/20_CPANPLUS-Dist-MM.t.FAILED ??
    ../lib/IPC/Cmd/t/01_IPC-Cmd.t...........FAILED ??
    ../t/io/dup.t...........................FAILED 15-16
    ../t/io/open.t..........................FAILED 93
    ../t/op/threads.t.......................FAILED 10
Inconsistent test results (between TEST and harness):
    ../t/op/reset.t.........................FAILED at test 22
    ../lib/CPANPLUS/Dist/Build/t/02_CPANPLUS-Dist-Build.tFAILED--non-zero wait status: 65280
    ../lib/Archive/Extract/t/01_Archive-Extract.tFAILED--non-zero wait status: 65280

[stdio] -Dusemymalloc -Duseithreads -Doptimize='-Os'
    ../ext/threads/t/free.t.................FAILED 2-29
    ../lib/CPANPLUS/t/20_CPANPLUS-Dist-MM.t.FAILED ??
    ../lib/IPC/Cmd/t/01_IPC-Cmd.t...........FAILED ??
    ../t/io/dup.t...........................FAILED 15-16
    ../t/io/open.t..........................FAILED 93
    ../t/op/reset.t.........................FAILED 22
    ../t/op/threads.t.......................FAILED 10
Inconsistent test results (between TEST and harness):
    ../lib/CPANPLUS/Dist/Build/t/02_CPANPLUS-Dist-Build.tFAILED--non-zero wait status: 65280
    ../ext/threads/t/stress_string.t........FAILED--expected 61 tests, saw 29
    ../ext/threads/shared/t/stress.t........FAILED--expected 1 tests, saw 0
    ../lib/Archive/Extract/t/01_Archive-Extract.tFAILED--non-zero wait status: 65280

[perlio] -Dusemymalloc -Duseithreads -Doptimize='-Os'
    ../ext/threads/shared/t/stress.t........FAILED 1
    ../lib/CPANPLUS/t/20_CPANPLUS-Dist-MM.t.FAILED ??
    ../lib/IPC/Cmd/t/01_IPC-Cmd.t...........FAILED ??
    ../t/io/dup.t...........................FAILED 15-16
    ../t/io/open.t..........................FAILED 93
    ../t/op/threads.t.......................FAILED 4-10
Inconsistent test results (between TEST and harness):
    ../lib/CPANPLUS/Dist/Build/t/02_CPANPLUS-Dist-Build.tFAILED--non-zero wait status: 65280
    ../lib/Archive/Extract/t/01_Archive-Extract.tFAILED--non-zero wait status: 65280
    ../ext/threads/t/stress_cv.t............FAILED--expected 61 tests, saw 11

[stdio] -DDEBUGGING -Dusemymalloc -Duseithreads -Doptimize='-Os'
    ../ext/threads/shared/t/stress.t........FAILED 1
    ../ext/threads/t/free2.t................FAILED 2-78
    ../lib/CPANPLUS/t/20_CPANPLUS-Dist-MM.t.FAILED ??
    ../lib/IPC/Cmd/t/01_IPC-Cmd.t...........FAILED ??
    ../t/io/dup.t...........................FAILED 15-16
    ../t/io/open.t..........................FAILED 93
    ../t/op/reset.t.........................FAILED 24
    ../t/op/threads.t.......................FAILED 10
Inconsistent test results (between TEST and harness):
    ../lib/Test/Simple/t/is_deeply_with_threads.tFAILED--expected 505 tests, saw 0
    ../lib/CPANPLUS/Dist/Build/t/02_CPANPLUS-Dist-Build.tFAILED--non-zero wait status: 65280
    ../lib/Archive/Extract/t/01_Archive-Extract.tFAILED--non-zero wait status: 65280

[perlio] -DDEBUGGING -Dusemymalloc -Duseithreads -Doptimize='-Os'
    ../ext/threads/shared/t/stress.t........FAILED 1
    ../lib/CPANPLUS/t/20_CPANPLUS-Dist-MM.t.FAILED ??
    ../lib/IPC/Cmd/t/01_IPC-Cmd.t...........FAILED ??
    ../t/io/dup.t...........................FAILED 15-16
    ../t/io/open.t..........................FAILED 93
    ../t/op/threads.t.......................FAILED 10
Inconsistent test results (between TEST and harness):
    ../lib/Test/Simple/t/is_deeply_with_threads.tFAILED--expected 505 tests, saw 0
    ../t/op/reset.t.........................FAILED at test 21
    ../lib/CPANPLUS/Dist/Build/t/02_CPANPLUS-Dist-Build.tFAILED--non-zero wait status: 65280
    ../lib/Archive/Extract/t/01_Archive-Extract.tFAILED--non-zero wait status: 65280
    ../ext/threads/t/stress_cv.t............FAILED--expected 61 tests, saw 14

[stdio] -Dusemymalloc -Duseithreads -Doptimize='-Os' -DNO_MATHOMS
    ../lib/CPANPLUS/t/20_CPANPLUS-Dist-MM.t.FAILED ??
    ../lib/IPC/Cmd/t/01_IPC-Cmd.t...........FAILED ??
    ../t/io/dup.t...........................FAILED 15-16
    ../t/io/open.t..........................FAILED 93
    ../t/op/reset.t.........................FAILED 23
    ../t/op/threads.t.......................FAILED 10
Inconsistent test results (between TEST and harness):
    ../lib/CPANPLUS/Dist/Build/t/02_CPANPLUS-Dist-Build.tFAILED--non-zero wait status: 65280
    ../lib/Archive/Extract/t/01_Archive-Extract.tFAILED--non-zero wait status: 65280

[perlio] -Dusemymalloc -Duseithreads -Doptimize='-Os' -DNO_MATHOMS
    ../lib/CPANPLUS/t/20_CPANPLUS-Dist-MM.t.FAILED ??
    ../lib/IPC/Cmd/t/01_IPC-Cmd.t...........FAILED ??
    ../t/io/dup.t...........................FAILED 15-16
    ../t/io/open.t..........................FAILED 93
    ../t/op/reset.t.........................FAILED 21-23
    ../t/op/threads.t.......................FAILED 10
Inconsistent test results (between TEST and harness):
    ../lib/CPANPLUS/Dist/Build/t/02_CPANPLUS-Dist-Build.tFAILED--non-zero wait status: 65280
    ../lib/Archive/Extract/t/01_Archive-Extract.tFAILED--non-zero wait status: 65280

[perlio] -DDEBUGGING -Dusemymalloc -Duseithreads -Doptimize='-Os' -DNO_MATHOMS
    ../ext/threads/shared/t/stress.t........FAILED 1
    ../ext/threads/t/free2.t................FAILED 2-78
    ../lib/CPANPLUS/t/20_CPANPLUS-Dist-MM.t.FAILED ??
    ../lib/IPC/Cmd/t/01_IPC-Cmd.t...........FAILED ??
    ../t/io/dup.t...........................FAILED 15-16
    ../t/io/open.t..........................FAILED 93
    ../t/op/threads.t.......................FAILED 10
Inconsistent test results (between TEST and harness):
    ../lib/CPANPLUS/Dist/Build/t/02_CPANPLUS-Dist-Build.tFAILED--non-zero wait status: 65280
    ../lib/Archive/Extract/t/01_Archive-Extract.tFAILED--non-zero wait status: 65280

[stdio] -Dusemymalloc -Duseithreads -Doptimize='-O3 -fomit-frame-pointer -fno-strict-aliasing -pipe'
    ../ext/threads/shared/t/stress.t........FAILED 1
    ../lib/CPANPLUS/t/20_CPANPLUS-Dist-MM.t.FAILED ??
    ../lib/IPC/Cmd/t/01_IPC-Cmd.t...........FAILED ??
    ../t/io/dup.t...........................FAILED 15-16
    ../t/io/open.t..........................FAILED 93
    ../t/op/reset.t.........................FAILED 23
    ../t/op/threads.t.......................FAILED 10
Inconsistent test results (between TEST and harness):
    ../lib/CPANPLUS/Dist/Build/t/02_CPANPLUS-Dist-Build.tFAILED--non-zero wait status: 65280
    ../ext/threads/t/free2.t................FAILED--expected 78 tests, saw 1
    ../lib/Archive/Extract/t/01_Archive-Extract.tFAILED--non-zero wait status: 65280

[perlio] -Dusemymalloc -Duseithreads -Doptimize='-O3 -fomit-frame-pointer -fno-strict-aliasing -pipe'
    ../ext/threads/shared/t/stress.t........FAILED 1
    ../lib/CPANPLUS/t/20_CPANPLUS-Dist-MM.t.FAILED ??
    ../lib/IPC/Cmd/t/01_IPC-Cmd.t...........FAILED ??
    ../t/io/dup.t...........................FAILED 15-16
    ../t/io/open.t..........................FAILED 93
    ../t/op/threads.t.......................FAILED 10
Inconsistent test results (between TEST and harness):
    ../lib/CPANPLUS/Dist/Build/t/02_CPANPLUS-Dist-Build.tFAILED--non-zero wait status: 65280
    ../lib/Archive/Extract/t/01_Archive-Extract.tFAILED--non-zero wait status: 65280

[stdio] -Dusemymalloc -Duseithreads -Doptimize='-O3 -fomit-frame-pointer -fno-strict-aliasing -pipe' -DNO_MATHOMS
    ../ext/threads/shared/t/stress.t........FAILED 1
    ../lib/CPANPLUS/t/20_CPANPLUS-Dist-MM.t.FAILED ??
    ../lib/IPC/Cmd/t/01_IPC-Cmd.t...........FAILED ??
    ../t/io/dup.t...........................FAILED 15-16
    ../t/io/open.t..........................FAILED 93
    ../t/op/reset.t.........................FAILED 24
    ../t/op/threads.t.......................FAILED 10
Inconsistent test results (between TEST and harness):
    ../lib/CPANPLUS/Dist/Build/t/02_CPANPLUS-Dist-Build.tFAILED--non-zero wait status: 65280
    ../lib/Archive/Extract/t/01_Archive-Extract.tFAILED--non-zero wait status: 65280

[perlio] -Dusemymalloc -Duseithreads -Doptimize='-O3 -fomit-frame-pointer -fno-strict-aliasing -pipe' -DNO_MATHOMS
    ../ext/threads/shared/t/stress.t........FAILED 1
    ../lib/CPANPLUS/t/20_CPANPLUS-Dist-MM.t.FAILED ??
    ../lib/IPC/Cmd/t/01_IPC-Cmd.t...........FAILED ??
    ../t/io/dup.t...........................FAILED 15-16
    ../t/io/open.t..........................FAILED 93
    ../t/op/reset.t.........................FAILED 24
    ../t/op/threads.t.......................FAILED 10
Inconsistent test results (between TEST and harness):
    ../lib/Test/Simple/t/is_deeply_with_threads.tFAILED--expected 505 tests, saw 0
    ../lib/CPANPLUS/Dist/Build/t/02_CPANPLUS-Dist-Build.tFAILED--non-zero wait status: 65280
    ../lib/Archive/Extract/t/01_Archive-Extract.tFAILED--non-zero wait status: 65280

[stdio] -DDEBUGGING -Dusemymalloc -Duseithreads -Doptimize='-O3 -fomit-frame-pointer -fno-strict-aliasing -pipe' -DNO_MATHOMS
    ../ext/threads/shared/t/stress.t........FAILED 1
    ../lib/CPANPLUS/t/20_CPANPLUS-Dist-MM.t.FAILED ??
    ../lib/IPC/Cmd/t/01_IPC-Cmd.t...........FAILED ??
    ../t/io/dup.t...........................FAILED 15-16
    ../t/io/open.t..........................FAILED 93
    ../t/op/threads.t.......................FAILED 10
Inconsistent test results (between TEST and harness):
    ../lib/Test/Simple/t/is_deeply_with_threads.tFAILED--expected 505 tests, saw 1
    ../lib/CPANPLUS/Dist/Build/t/02_CPANPLUS-Dist-Build.tFAILED--non-zero wait status: 65280
    ../lib/Archive/Extract/t/01_Archive-Extract.tFAILED--non-zero wait status: 65280

[perlio] -DDEBUGGING -Dusemymalloc -Duseithreads -Doptimize='-O3 -fomit-frame-pointer -fno-strict-aliasing -pipe' -DNO_MATHOMS
    ../ext/threads/shared/t/stress.t........FAILED 1
    ../lib/CPANPLUS/t/20_CPANPLUS-Dist-MM.t.FAILED ??
    ../lib/IPC/Cmd/t/01_IPC-Cmd.t...........FAILED ??
    ../t/io/dup.t...........................FAILED 15-16
    ../t/io/open.t..........................FAILED 93
    ../t/op/threads.t.......................FAILED 10
Inconsistent test results (between TEST and harness):
    ../t/op/reset.t.........................FAILED at test 24
    ../lib/CPANPLUS/Dist/Build/t/02_CPANPLUS-Dist-Build.tFAILED--non-zero wait status: 65280
    ../lib/Archive/Extract/t/01_Archive-Extract.tFAILED--non-zero wait status: 65280

Compiler messages(gcc):
mg.c: In function `Perl_sighandler':
mg.c:2904: warning: null format string
pp_sys.c: In function `Perl_pp_die':
pp_sys.c:491: warning: null format string

-- 
Report by Test::Smoke v1.19_84 build 1008 running on perl 5.8.8
(Reporter v0.026 / Smoker v0.030)



nntp.perl.org: Perl Programming lists via nntp and http.
Comments to Ask Bjørn Hansen at ask@perl.org | Group listing | About