develooper Front page | perl.perl5.porters | Postings from May 2007

Re: Smoke [5.9.5] 31260 FAIL(m) HP-UX B.11.23/64 (ia64/2 cpu)

Thread Previous
From:
H.Merijn Brand
Date:
May 24, 2007 02:36
Subject:
Re: Smoke [5.9.5] 31260 FAIL(m) HP-UX B.11.23/64 (ia64/2 cpu)
Message ID:
20070524093403.208dc314@pc09
On Thu, 24 May 2007 09:19 +0200, "H.Merijn Brand" <h.m.brand@xs4all.nl> wrote:

> Automated smoke report for 5.9.5 patch 31260
> x1: Intel(R) Itanium 2 processor/1600 MHz (ia64/2 cpu)
>     on        HP-UX - B.11.23/64
>     using     cc version [Feb
>     smoketime 3 hours 41 minutes (average 27 minutes 45 seconds)
> 
> Summary: FAIL(m)
> 
> O = OK  F = Failure(s), extended report at the bottom
> X = Failure(s) under TEST but not under harness
> ? = still running or test results not (yet) available
> Build failures during:       - = unknown or N/A
> c = Configure, m = make, M = make (after miniperl), t = make test-prep
> 
>    31260     Configuration (common) -Dcc=gcc
> ----------- ---------------------------------------------------------
> O O O O O O 
> m - - m - - -Duse64bitall

Manual build for 31263:

All tests successful (2 subtests UNEXPECTEDLY SUCCEEDED), 79 tests and 713 subtests skipped.
Passed TODO                     Stat Wstat TODOs Pass  List of Passed
-------------------------------------------------------------------------------
../lib/Net/Ping/t/450_service.t                2    2  9 18
Files=1438, Tests=181574, 827 wallclock secs (421.00 cusr + 118.02 csys = 539.02 CPU)

From the smoke build log:
Writing compiled form
make[1]: *** [Makefile] Error 1
68325 bytes in string tables
1191 bytes (1.71%) saved spotting duplicates
Making header files for XS...
make[1]: *** [Makefile] Error 1
make[1]: *** [Makefile] Error 1
make[1]: *** [Makefile] Error 1
make[1]: *** [Makefile] Error 1
make[1]: *** [Makefile] Error 1
Processing hints file hints/hpux.pl
re.xs:50: warning: initialization from incompatible pointer type
re.xs: In function 'install':
re.xs:90: warning: assignment from incompatible pointer type
make[1]: *** [Makefile] Error 1
make[1]: *** [Makefile] Error 1
make[1]: *** [Makefile] Error 1

> O O O O O O -Duseithreads
> m - - m - - -Duseithreads -Duse64bitall
> | | | | | +- LC_ALL = univ.utf8 -DDEBUGGING
> | | | | +--- PERLIO = perlio -DDEBUGGING
> | | | +----- PERLIO = stdio  -DDEBUGGING
> | | +------- LC_ALL = univ.utf8
> | +--------- PERLIO = perlio
> +----------- PERLIO = stdio
> 
> Locally applied patches:
>     DEVEL
>     SMOKE31260
> 
> MANIFEST did not declare '.config/README'
> MANIFEST did not declare '.config/instruct'
> MANIFEST did not declare 'Makefile'
> MANIFEST did not declare 'cflags'
> MANIFEST did not declare 'config.h'
> MANIFEST did not declare 'ext/Compress/Zlib/Makefile'
> MANIFEST did not declare 'ext/Compress/Zlib/Makefile.old'
> MANIFEST did not declare 'ext/Compress/Zlib/blib/bin/.exists'
> MANIFEST did not declare 'ext/Compress/Zlib/blib/man1/.exists'
> MANIFEST did not declare 'ext/Compress/Zlib/blib/man3/.exists'
> MANIFEST did not declare 'ext/Compress/Zlib/blib/script/.exists'
> MANIFEST did not declare 'ext/Compress/Zlib/pm_to_blib'
> MANIFEST did not declare 'ext/Devel/DProf/DProf.bs'
> MANIFEST did not declare 'ext/Devel/DProf/DProf.c'
> MANIFEST did not declare 'ext/Devel/DProf/DProf.o'
> MANIFEST did not declare 'ext/Devel/DProf/Makefile'
> MANIFEST did not declare 'ext/Devel/DProf/Makefile.old'
> MANIFEST did not declare 'ext/Devel/DProf/blib/bin/.exists'
> MANIFEST did not declare 'ext/Devel/DProf/blib/man1/.exists'
> MANIFEST did not declare 'ext/Devel/DProf/blib/man3/.exists'
> MANIFEST did not declare 'ext/Devel/DProf/blib/script/.exists'
> MANIFEST did not declare 'ext/Devel/DProf/pm_to_blib'
> MANIFEST did not declare 'ext/Devel/PPPort/Makefile'
> MANIFEST did not declare 'ext/Devel/PPPort/Makefile.old'
> MANIFEST did not declare 'ext/Devel/PPPort/PPPort.bs'
> MANIFEST did not declare 'ext/Devel/PPPort/PPPort.pm'
> MANIFEST did not declare 'ext/Devel/PPPort/RealPPPort.c'
> MANIFEST did not declare 'ext/Devel/PPPort/RealPPPort.o'
> MANIFEST did not declare 'ext/Devel/PPPort/RealPPPort.xs'
> MANIFEST did not declare 'ext/Devel/PPPort/blib/bin/.exists'
> MANIFEST did not declare 'ext/Devel/PPPort/blib/man1/.exists'
> MANIFEST did not declare 'ext/Devel/PPPort/blib/man3/.exists'
> MANIFEST did not declare 'ext/Devel/PPPort/blib/script/.exists'
> MANIFEST did not declare 'ext/Devel/PPPort/module2.o'
> MANIFEST did not declare 'ext/Devel/PPPort/module3.o'
> MANIFEST did not declare 'ext/Devel/PPPort/pm_to_blib'
> MANIFEST did not declare 'ext/Devel/PPPort/ppport.h'
> MANIFEST did not declare 'ext/Devel/Peek/Makefile'
> MANIFEST did not declare 'ext/Devel/Peek/Makefile.old'
> MANIFEST did not declare 'ext/Devel/Peek/Peek.bs'
> MANIFEST did not declare 'ext/Devel/Peek/Peek.c'
> MANIFEST did not declare 'ext/Devel/Peek/Peek.o'
> MANIFEST did not declare 'ext/Devel/Peek/blib/bin/.exists'
> MANIFEST did not declare 'ext/Devel/Peek/blib/man1/.exists'
> MANIFEST did not declare 'ext/Devel/Peek/blib/man3/.exists'
> MANIFEST did not declare 'ext/Devel/Peek/blib/script/.exists'
> MANIFEST did not declare 'ext/Devel/Peek/pm_to_blib'
> MANIFEST did not declare 'ext/Digest/MD5/MD5.bs'
> MANIFEST did not declare 'ext/Digest/MD5/MD5.c'
> MANIFEST did not declare 'ext/Digest/MD5/MD5.o'
> MANIFEST did not declare 'ext/Digest/MD5/Makefile'
> MANIFEST did not declare 'ext/Digest/MD5/Makefile.old'
> MANIFEST did not declare 'ext/Digest/MD5/blib/bin/.exists'
> MANIFEST did not declare 'ext/Digest/MD5/blib/man1/.exists'
> MANIFEST did not declare 'ext/Digest/MD5/blib/man3/.exists'
> MANIFEST did not declare 'ext/Digest/MD5/blib/script/.exists'
> MANIFEST did not declare 'ext/Digest/MD5/pm_to_blib'
> MANIFEST did not declare 'ext/Digest/SHA/Makefile'
> MANIFEST did not declare 'ext/Digest/SHA/Makefile.old'
> MANIFEST did not declare 'ext/Digest/SHA/SHA.bs'
> MANIFEST did not declare 'ext/Digest/SHA/SHA.c'
> MANIFEST did not declare 'ext/Digest/SHA/SHA.o'
> MANIFEST did not declare 'ext/Digest/SHA/blib/bin/.exists'
> MANIFEST did not declare 'ext/Digest/SHA/blib/man1/.exists'
> MANIFEST did not declare 'ext/Digest/SHA/blib/man3/.exists'
> MANIFEST did not declare 'ext/Digest/SHA/blib/script/.exists'
> MANIFEST did not declare 'ext/Digest/SHA/pm_to_blib'
> MANIFEST did not declare 'ext/Encode/Byte/Byte.bs'
> MANIFEST did not declare 'ext/Encode/Byte/Byte.c'
> MANIFEST did not declare 'ext/Encode/Byte/Byte.o'
> MANIFEST did not declare 'ext/Encode/Byte/Byte.xs'
> MANIFEST did not declare 'ext/Encode/Byte/Makefile'
> MANIFEST did not declare 'ext/Encode/Byte/Makefile.old'
> MANIFEST did not declare 'ext/Encode/Byte/byte_t.c'
> MANIFEST did not declare 'ext/Encode/Byte/byte_t.exh'
> MANIFEST did not declare 'ext/Encode/Byte/byte_t.fnm'
> MANIFEST did not declare 'ext/Encode/Byte/byte_t.h'
> MANIFEST did not declare 'ext/Encode/Byte/byte_t.o'
> MANIFEST did not declare 'ext/Encode/Byte/pm_to_blib'
> MANIFEST did not declare 'ext/Encode/CN/CN.bs'
> MANIFEST did not declare 'ext/Encode/CN/CN.c'
> MANIFEST did not declare 'ext/Encode/CN/CN.o'
> MANIFEST did not declare 'ext/Encode/CN/CN.xs'
> MANIFEST did not declare 'ext/Encode/CN/Makefile'
> MANIFEST did not declare 'ext/Encode/CN/Makefile.old'
> MANIFEST did not declare 'ext/Encode/CN/cp_00_t.c'
> MANIFEST did not declare 'ext/Encode/CN/cp_00_t.exh'
> MANIFEST did not declare 'ext/Encode/CN/cp_00_t.fnm'
> MANIFEST did not declare 'ext/Encode/CN/cp_00_t.h'
> MANIFEST did not declare 'ext/Encode/CN/cp_00_t.o'
> MANIFEST did not declare 'ext/Encode/CN/eu_01_t.c'
> MANIFEST did not declare 'ext/Encode/CN/eu_01_t.exh'
> MANIFEST did not declare 'ext/Encode/CN/eu_01_t.fnm'
> MANIFEST did not declare 'ext/Encode/CN/eu_01_t.h'
> MANIFEST did not declare 'ext/Encode/CN/eu_01_t.o'
> MANIFEST did not declare 'ext/Encode/CN/gb_02_t.c'
> MANIFEST did not declare 'ext/Encode/CN/gb_02_t.exh'
> MANIFEST did not declare 'ext/Encode/CN/gb_02_t.fnm'
> MANIFEST did not declare 'ext/Encode/CN/gb_02_t.h'
> MANIFEST did not declare 'ext/Encode/CN/gb_02_t.o'
> MANIFEST did not declare 'ext/Encode/CN/gb_03_t.c'
> MANIFEST did not declare 'ext/Encode/CN/gb_03_t.exh'
> MANIFEST did not declare 'ext/Encode/CN/gb_03_t.fnm'
> MANIFEST did not declare 'ext/Encode/CN/gb_03_t.h'
> MANIFEST did not declare 'ext/Encode/CN/gb_03_t.o'
> MANIFEST did not declare 'ext/Encode/CN/ir_04_t.c'
> MANIFEST did not declare 'ext/Encode/CN/ir_04_t.exh'
> MANIFEST did not declare 'ext/Encode/CN/ir_04_t.fnm'
> MANIFEST did not declare 'ext/Encode/CN/ir_04_t.h'
> MANIFEST did not declare 'ext/Encode/CN/ir_04_t.o'
> MANIFEST did not declare 'ext/Encode/CN/ma_05_t.c'
> MANIFEST did not declare 'ext/Encode/CN/ma_05_t.exh'
> MANIFEST did not declare 'ext/Encode/CN/ma_05_t.fnm'
> MANIFEST did not declare 'ext/Encode/CN/ma_05_t.h'
> MANIFEST did not declare 'ext/Encode/CN/ma_05_t.o'
> MANIFEST did not declare 'ext/Encode/CN/pm_to_blib'
> MANIFEST did not declare 'ext/Encode/EBCDIC/EBCDIC.bs'
> MANIFEST did not declare 'ext/Encode/EBCDIC/EBCDIC.c'
> MANIFEST did not declare 'ext/Encode/EBCDIC/EBCDIC.o'
> MANIFEST did not declare 'ext/Encode/EBCDIC/EBCDIC.xs'
> MANIFEST did not declare 'ext/Encode/EBCDIC/Makefile'
> MANIFEST did not declare 'ext/Encode/EBCDIC/Makefile.old'
> MANIFEST did not declare 'ext/Encode/EBCDIC/ebcdic_t.c'
> MANIFEST did not declare 'ext/Encode/EBCDIC/ebcdic_t.exh'
> MANIFEST did not declare 'ext/Encode/EBCDIC/ebcdic_t.fnm'
> MANIFEST did not declare 'ext/Encode/EBCDIC/ebcdic_t.h'
> MANIFEST did not declare 'ext/Encode/EBCDIC/ebcdic_t.o'
> MANIFEST did not declare 'ext/Encode/EBCDIC/pm_to_blib'
> MANIFEST did not declare 'ext/Encode/Encode.bs'
> MANIFEST did not declare 'ext/Encode/Encode.c'
> MANIFEST did not declare 'ext/Encode/Encode.o'
> MANIFEST did not declare 'ext/Encode/JP/JP.bs'
> MANIFEST did not declare 'ext/Encode/JP/JP.c'
> MANIFEST did not declare 'ext/Encode/JP/JP.o'
> MANIFEST did not declare 'ext/Encode/JP/JP.xs'
> MANIFEST did not declare 'ext/Encode/JP/Makefile'
> MANIFEST did not declare 'ext/Encode/JP/Makefile.old'
> MANIFEST did not declare 'ext/Encode/JP/cp_00_t.c'
> MANIFEST did not declare 'ext/Encode/JP/cp_00_t.exh'
> MANIFEST did not declare 'ext/Encode/JP/cp_00_t.fnm'
> MANIFEST did not declare 'ext/Encode/JP/cp_00_t.h'
> MANIFEST did not declare 'ext/Encode/JP/cp_00_t.o'
> MANIFEST did not declare 'ext/Encode/JP/eu_01_t.c'
> MANIFEST did not declare 'ext/Encode/JP/eu_01_t.exh'
> MANIFEST did not declare 'ext/Encode/JP/eu_01_t.fnm'
> MANIFEST did not declare 'ext/Encode/JP/eu_01_t.h'
> MANIFEST did not declare 'ext/Encode/JP/eu_01_t.o'
> MANIFEST did not declare 'ext/Encode/JP/ji_02_t.c'
> MANIFEST did not declare 'ext/Encode/JP/ji_02_t.exh'
> MANIFEST did not declare 'ext/Encode/JP/ji_02_t.fnm'
> MANIFEST did not declare 'ext/Encode/JP/ji_02_t.h'
> MANIFEST did not declare 'ext/Encode/JP/ji_02_t.o'
> MANIFEST did not declare 'ext/Encode/JP/ji_03_t.c'
> MANIFEST did not declare 'ext/Encode/JP/ji_03_t.exh'
> MANIFEST did not declare 'ext/Encode/JP/ji_03_t.fnm'
> MANIFEST did not declare 'ext/Encode/JP/ji_03_t.h'
> MANIFEST did not declare 'ext/Encode/JP/ji_03_t.o'
> MANIFEST did not declare 'ext/Encode/JP/ji_04_t.c'
> MANIFEST did not declare 'ext/Encode/JP/ji_04_t.exh'
> MANIFEST did not declare 'ext/Encode/JP/ji_04_t.fnm'
> MANIFEST did not declare 'ext/Encode/JP/ji_04_t.h'
> MANIFEST did not declare 'ext/Encode/JP/ji_04_t.o'
> MANIFEST did not declare 'ext/Encode/JP/ma_05_t.c'
> MANIFEST did not declare 'ext/Encode/JP/ma_05_t.exh'
> MANIFEST did not declare 'ext/Encode/JP/ma_05_t.fnm'
> MANIFEST did not declare 'ext/Encode/JP/ma_05_t.h'
> MANIFEST did not declare 'ext/Encode/JP/ma_05_t.o'
> MANIFEST did not declare 'ext/Encode/JP/pm_to_blib'
> MANIFEST did not declare 'ext/Encode/JP/sh_06_t.c'
> MANIFEST did not declare 'ext/Encode/JP/sh_06_t.exh'
> MANIFEST did not declare 'ext/Encode/JP/sh_06_t.fnm'
> MANIFEST did not declare 'ext/Encode/JP/sh_06_t.h'
> MANIFEST did not declare 'ext/Encode/JP/sh_06_t.o'
> MANIFEST did not declare 'ext/Encode/KR/KR.bs'
> MANIFEST did not declare 'ext/Encode/KR/KR.c'
> MANIFEST did not declare 'ext/Encode/KR/KR.o'
> MANIFEST did not declare 'ext/Encode/KR/KR.xs'
> MANIFEST did not declare 'ext/Encode/KR/Makefile'
> MANIFEST did not declare 'ext/Encode/KR/Makefile.old'
> MANIFEST did not declare 'ext/Encode/KR/cp_00_t.c'
> MANIFEST did not declare 'ext/Encode/KR/cp_00_t.exh'
> MANIFEST did not declare 'ext/Encode/KR/cp_00_t.fnm'
> MANIFEST did not declare 'ext/Encode/KR/cp_00_t.h'
> MANIFEST did not declare 'ext/Encode/KR/cp_00_t.o'
> MANIFEST did not declare 'ext/Encode/KR/eu_01_t.c'
> MANIFEST did not declare 'ext/Encode/KR/eu_01_t.exh'
> MANIFEST did not declare 'ext/Encode/KR/eu_01_t.fnm'
> MANIFEST did not declare 'ext/Encode/KR/eu_01_t.h'
> MANIFEST did not declare 'ext/Encode/KR/eu_01_t.o'
> MANIFEST did not declare 'ext/Encode/KR/jo_02_t.c'
> MANIFEST did not declare 'ext/Encode/KR/jo_02_t.exh'
> MANIFEST did not declare 'ext/Encode/KR/jo_02_t.fnm'
> MANIFEST did not declare 'ext/Encode/KR/jo_02_t.h'
> MANIFEST did not declare 'ext/Encode/KR/jo_02_t.o'
> MANIFEST did not declare 'ext/Encode/KR/ks_03_t.c'
> MANIFEST did not declare 'ext/Encode/KR/ks_03_t.exh'
> MANIFEST did not declare 'ext/Encode/KR/ks_03_t.fnm'
> MANIFEST did not declare 'ext/Encode/KR/ks_03_t.h'
> MANIFEST did not declare 'ext/Encode/KR/ks_03_t.o'
> MANIFEST did not declare 'ext/Encode/KR/ma_04_t.c'
> MANIFEST did not declare 'ext/Encode/KR/ma_04_t.exh'
> MANIFEST did not declare 'ext/Encode/KR/ma_04_t.fnm'
> MANIFEST did not declare 'ext/Encode/KR/ma_04_t.h'
> MANIFEST did not declare 'ext/Encode/KR/ma_04_t.o'
> MANIFEST did not declare 'ext/Encode/KR/pm_to_blib'
> MANIFEST did not declare 'ext/Encode/Makefile'
> MANIFEST did not declare 'ext/Encode/Makefile.old'
> MANIFEST did not declare 'ext/Encode/Symbol/Makefile'
> MANIFEST did not declare 'ext/Encode/Symbol/Makefile.old'
> MANIFEST did not declare 'ext/Encode/Symbol/Symbol.bs'
> MANIFEST did not declare 'ext/Encode/Symbol/Symbol.c'
> MANIFEST did not declare 'ext/Encode/Symbol/Symbol.o'
> MANIFEST did not declare 'ext/Encode/Symbol/Symbol.xs'
> MANIFEST did not declare 'ext/Encode/Symbol/pm_to_blib'
> MANIFEST did not declare 'ext/Encode/Symbol/symbol_t.c'
> MANIFEST did not declare 'ext/Encode/Symbol/symbol_t.exh'
> MANIFEST did not declare 'ext/Encode/Symbol/symbol_t.fnm'
> MANIFEST did not declare 'ext/Encode/Symbol/symbol_t.h'
> MANIFEST did not declare 'ext/Encode/Symbol/symbol_t.o'
> MANIFEST did not declare 'ext/Encode/TW/Makefile'
> MANIFEST did not declare 'ext/Encode/TW/Makefile.old'
> MANIFEST did not declare 'ext/Encode/TW/TW.bs'
> MANIFEST did not declare 'ext/Encode/TW/TW.c'
> MANIFEST did not declare 'ext/Encode/TW/TW.o'
> MANIFEST did not declare 'ext/Encode/TW/TW.xs'
> MANIFEST did not declare 'ext/Encode/TW/bi_00_t.c'
> MANIFEST did not declare 'ext/Encode/TW/bi_00_t.exh'
> MANIFEST did not declare 'ext/Encode/TW/bi_00_t.fnm'
> MANIFEST did not declare 'ext/Encode/TW/bi_00_t.h'
> MANIFEST did not declare 'ext/Encode/TW/bi_00_t.o'
> MANIFEST did not declare 'ext/Encode/TW/bi_01_t.c'
> MANIFEST did not declare 'ext/Encode/TW/bi_01_t.exh'
> MANIFEST did not declare 'ext/Encode/TW/bi_01_t.fnm'
> MANIFEST did not declare 'ext/Encode/TW/bi_01_t.h'
> MANIFEST did not declare 'ext/Encode/TW/bi_01_t.o'
> MANIFEST did not declare 'ext/Encode/TW/cp_02_t.c'
> MANIFEST did not declare 'ext/Encode/TW/cp_02_t.exh'
> MANIFEST did not declare 'ext/Encode/TW/cp_02_t.fnm'
> MANIFEST did not declare 'ext/Encode/TW/cp_02_t.h'
> MANIFEST did not declare 'ext/Encode/TW/cp_02_t.o'
> MANIFEST did not declare 'ext/Encode/TW/ma_03_t.c'
> MANIFEST did not declare 'ext/Encode/TW/ma_03_t.exh'
> MANIFEST did not declare 'ext/Encode/TW/ma_03_t.fnm'
> MANIFEST did not declare 'ext/Encode/TW/ma_03_t.h'
> MANIFEST did not declare 'ext/Encode/TW/ma_03_t.o'
> MANIFEST did not declare 'ext/Encode/TW/pm_to_blib'
> MANIFEST did not declare 'ext/Encode/Unicode/Makefile'
> MANIFEST did not declare 'ext/Encode/Unicode/Makefile.old'
> MANIFEST did not declare 'ext/Encode/Unicode/Unicode.bs'
> MANIFEST did not declare 'ext/Encode/Unicode/Unicode.c'
> MANIFEST did not declare 'ext/Encode/Unicode/Unicode.o'
> MANIFEST did not declare 'ext/Encode/Unicode/pm_to_blib'
> MANIFEST did not declare 'ext/Encode/blib/bin/.exists'
> MANIFEST did not declare 'ext/Encode/blib/man1/.exists'
> MANIFEST did not declare 'ext/Encode/blib/man3/.exists'
> MANIFEST did not declare 'ext/Encode/blib/script/.exists'
> MANIFEST did not declare 'ext/Encode/blib/script/enc2xs'
> MANIFEST did not declare 'ext/Encode/blib/script/piconv'
> MANIFEST did not declare 'ext/Encode/def_t.c'
> MANIFEST did not declare 'ext/Encode/def_t.exh'
> MANIFEST did not declare 'ext/Encode/def_t.fnm'
> MANIFEST did not declare 'ext/Encode/def_t.h'
> MANIFEST did not declare 'ext/Encode/def_t.o'
> MANIFEST did not declare 'ext/Encode/encengine.o'
> MANIFEST did not declare 'ext/Encode/pm_to_blib'
> MANIFEST did not declare 'ext/Errno/Errno.pm'
> MANIFEST did not declare 'ext/Errno/Makefile'
> MANIFEST did not declare 'ext/Errno/Makefile.old'
> MANIFEST did not declare 'ext/Errno/arch.txt'
> MANIFEST did not declare 'ext/Errno/blib/bin/.exists'
> MANIFEST did not declare 'ext/Errno/blib/man1/.exists'
> MANIFEST did not declare 'ext/Errno/blib/man3/.exists'
> MANIFEST did not declare 'ext/Errno/blib/script/.exists'
> MANIFEST did not declare 'ext/Errno/pm_to_blib'
> MANIFEST did not declare 'ext/Fcntl/Fcntl.bs'
> MANIFEST did not declare 'ext/Fcntl/Fcntl.c'
> MANIFEST did not declare 'ext/Fcntl/Fcntl.o'
> MANIFEST did not declare 'ext/Fcntl/Makefile'
> MANIFEST did not declare 'ext/Fcntl/Makefile.old'
> MANIFEST did not declare 'ext/Fcntl/blib/bin/.exists'
> MANIFEST did not declare 'ext/Fcntl/blib/man1/.exists'
> MANIFEST did not declare 'ext/Fcntl/blib/man3/.exists'
> MANIFEST did not declare 'ext/Fcntl/blib/script/.exists'
> MANIFEST did not declare 'ext/Fcntl/const-c.inc'
> MANIFEST did not declare 'ext/Fcntl/const-xs.inc'
> MANIFEST did not declare 'ext/Fcntl/pm_to_blib'
> MANIFEST did not declare 'ext/File/Glob/Glob.bs'
> MANIFEST did not declare 'ext/File/Glob/Glob.c'
> MANIFEST did not declare 'ext/File/Glob/Glob.o'
> MANIFEST did not declare 'ext/File/Glob/Makefile'
> MANIFEST did not declare 'ext/File/Glob/Makefile.old'
> MANIFEST did not declare 'ext/File/Glob/blib/bin/.exists'
> MANIFEST did not declare 'ext/File/Glob/blib/man1/.exists'
> MANIFEST did not declare 'ext/File/Glob/blib/man3/.exists'
> MANIFEST did not declare 'ext/File/Glob/blib/script/.exists'
> MANIFEST did not declare 'ext/File/Glob/bsd_glob.o'
> MANIFEST did not declare 'ext/File/Glob/const-c.inc'
> MANIFEST did not declare 'ext/File/Glob/const-xs.inc'
> MANIFEST did not declare 'ext/File/Glob/pm_to_blib'
> MANIFEST did not declare 'ext/Filter/Util/Call/Call.bs'
> MANIFEST did not declare 'ext/Filter/Util/Call/Call.c'
> MANIFEST did not declare 'ext/Filter/Util/Call/Call.o'
> MANIFEST did not declare 'ext/Filter/Util/Call/Makefile'
> MANIFEST did not declare 'ext/Filter/Util/Call/Makefile.old'
> MANIFEST did not declare 'ext/Filter/Util/Call/blib/bin/.exists'
> MANIFEST did not declare 'ext/Filter/Util/Call/blib/man1/.exists'
> MANIFEST did not declare 'ext/Filter/Util/Call/blib/man3/.exists'
> MANIFEST did not declare 'ext/Filter/Util/Call/blib/script/.exists'
> MANIFEST did not declare 'ext/Filter/Util/Call/pm_to_blib'
> MANIFEST did not declare 'ext/GDBM_File/GDBM_File.bs'
> MANIFEST did not declare 'ext/GDBM_File/GDBM_File.c'
> MANIFEST did not declare 'ext/GDBM_File/GDBM_File.o'
> MANIFEST did not declare 'ext/GDBM_File/Makefile'
> MANIFEST did not declare 'ext/GDBM_File/Makefile.old'
> MANIFEST did not declare 'ext/GDBM_File/blib/bin/.exists'
> MANIFEST did not declare 'ext/GDBM_File/blib/man1/.exists'
> MANIFEST did not declare 'ext/GDBM_File/blib/man3/.exists'
> MANIFEST did not declare 'ext/GDBM_File/blib/script/.exists'
> MANIFEST did not declare 'ext/GDBM_File/const-c.inc'
> MANIFEST did not declare 'ext/GDBM_File/const-xs.inc'
> MANIFEST did not declare 'ext/GDBM_File/pm_to_blib'
> MANIFEST did not declare 'ext/Hash/Util/FieldHash/FieldHash.bs'
> MANIFEST did not declare 'ext/Hash/Util/FieldHash/FieldHash.c'
> MANIFEST did not declare 'ext/Hash/Util/FieldHash/FieldHash.o'
> MANIFEST did not declare 'ext/Hash/Util/FieldHash/Makefile'
> MANIFEST did not declare 'ext/Hash/Util/FieldHash/Makefile.old'
> MANIFEST did not declare 'ext/Hash/Util/FieldHash/pm_to_blib'
> MANIFEST did not declare 'ext/Hash/Util/Makefile'
> MANIFEST did not declare 'ext/Hash/Util/Makefile.old'
> MANIFEST did not declare 'ext/Hash/Util/Util.bs'
> MANIFEST did not declare 'ext/Hash/Util/Util.c'
> MANIFEST did not declare 'ext/Hash/Util/Util.o'
> MANIFEST did not declare 'ext/Hash/Util/blib/bin/.exists'
> MANIFEST did not declare 'ext/Hash/Util/blib/man1/.exists'
> MANIFEST did not declare 'ext/Hash/Util/blib/man3/.exists'
> MANIFEST did not declare 'ext/Hash/Util/blib/script/.exists'
> MANIFEST did not declare 'ext/Hash/Util/pm_to_blib'
> MANIFEST did not declare 'ext/I18N/Langinfo/Langinfo.bs'
> MANIFEST did not declare 'ext/I18N/Langinfo/Langinfo.c'
> MANIFEST did not declare 'ext/I18N/Langinfo/Langinfo.o'
> MANIFEST did not declare 'ext/I18N/Langinfo/Makefile'
> MANIFEST did not declare 'ext/I18N/Langinfo/Makefile.old'
> MANIFEST did not declare 'ext/I18N/Langinfo/blib/bin/.exists'
> MANIFEST did not declare 'ext/I18N/Langinfo/blib/man1/.exists'
> MANIFEST did not declare 'ext/I18N/Langinfo/blib/man3/.exists'
> MANIFEST did not declare 'ext/I18N/Langinfo/blib/script/.exists'
> MANIFEST did not declare 'ext/I18N/Langinfo/const-c.inc'
> MANIFEST did not declare 'ext/I18N/Langinfo/const-xs.inc'
> MANIFEST did not declare 'ext/I18N/Langinfo/pm_to_blib'
> MANIFEST did not declare 'ext/IO/IO.bs'
> MANIFEST did not declare 'ext/IO/IO.c'
> MANIFEST did not declare 'ext/IO/IO.o'
> MANIFEST did not declare 'ext/IO/Makefile'
> MANIFEST did not declare 'ext/IO/Makefile.old'
> MANIFEST did not declare 'ext/IO/blib/bin/.exists'
> MANIFEST did not declare 'ext/IO/blib/man1/.exists'
> MANIFEST did not declare 'ext/IO/blib/man3/.exists'
> MANIFEST did not declare 'ext/IO/blib/script/.exists'
> MANIFEST did not declare 'ext/IO/pm_to_blib'
> MANIFEST did not declare 'ext/IO/poll.o'
> MANIFEST did not declare 'ext/IO_Compress_Base/Makefile'
> MANIFEST did not declare 'ext/IO_Compress_Base/Makefile.old'
> MANIFEST did not declare 'ext/IO_Compress_Base/blib/bin/.exists'
> MANIFEST did not declare 'ext/IO_Compress_Base/blib/man1/.exists'
> MANIFEST did not declare 'ext/IO_Compress_Base/blib/man3/.exists'
> MANIFEST did not declare 'ext/IO_Compress_Base/blib/script/.exists'
> MANIFEST did not declare 'ext/IO_Compress_Base/pm_to_blib'
> MANIFEST did not declare 'ext/IO_Compress_Zlib/Makefile'
> MANIFEST did not declare 'ext/IO_Compress_Zlib/Makefile.old'
> MANIFEST did not declare 'ext/IO_Compress_Zlib/blib/bin/.exists'
> MANIFEST did not declare 'ext/IO_Compress_Zlib/blib/man1/.exists'
> MANIFEST did not declare 'ext/IO_Compress_Zlib/blib/man3/.exists'
> MANIFEST did not declare 'ext/IO_Compress_Zlib/blib/script/.exists'
> MANIFEST did not declare 'ext/IO_Compress_Zlib/pm_to_blib'
> MANIFEST did not declare 'ext/IPC/SysV/Makefile'
> MANIFEST did not declare 'ext/IPC/SysV/SysV.bs'
> MANIFEST did not declare 'ext/IPC/SysV/SysV.c'
> MANIFEST did not declare 'ext/IPC/SysV/SysV.o'
> MANIFEST did not declare 'ext/IPC/SysV/blib/bin/.exists'
> MANIFEST did not declare 'ext/IPC/SysV/blib/man1/.exists'
> MANIFEST did not declare 'ext/IPC/SysV/blib/man3/.exists'
> MANIFEST did not declare 'ext/IPC/SysV/blib/script/.exists'
> MANIFEST did not declare 'ext/IPC/SysV/pm_to_blib'
> MANIFEST did not declare 'ext/List/Util/Makefile'
> MANIFEST did not declare 'ext/List/Util/Makefile.old'
> MANIFEST did not declare 'ext/List/Util/Util.bs'
> MANIFEST did not declare 'ext/List/Util/Util.c'
> MANIFEST did not declare 'ext/List/Util/Util.o'
> MANIFEST did not declare 'ext/List/Util/blib/bin/.exists'
> MANIFEST did not declare 'ext/List/Util/blib/man1/.exists'
> MANIFEST did not declare 'ext/List/Util/blib/man3/.exists'
> MANIFEST did not declare 'ext/List/Util/blib/script/.exists'
> MANIFEST did not declare 'ext/List/Util/pm_to_blib'
> MANIFEST did not declare 'ext/MIME/Base64/Base64.bs'
> MANIFEST did not declare 'ext/MIME/Base64/Base64.c'
> MANIFEST did not declare 'ext/MIME/Base64/Base64.o'
> MANIFEST did not declare 'ext/MIME/Base64/Makefile'
> MANIFEST did not declare 'ext/MIME/Base64/Makefile.old'
> MANIFEST did not declare 'ext/MIME/Base64/blib/bin/.exists'
> MANIFEST did not declare 'ext/MIME/Base64/blib/man1/.exists'
> MANIFEST did not declare 'ext/MIME/Base64/blib/man3/.exists'
> MANIFEST did not declare 'ext/MIME/Base64/blib/script/.exists'
> MANIFEST did not declare 'ext/MIME/Base64/pm_to_blib'
> MANIFEST did not declare 'ext/Math/BigInt/FastCalc/FastCalc.bs'
> MANIFEST did not declare 'ext/Math/BigInt/FastCalc/FastCalc.c'
> MANIFEST did not declare 'ext/Math/BigInt/FastCalc/FastCalc.o'
> MANIFEST did not declare 'ext/Math/BigInt/FastCalc/Makefile'
> MANIFEST did not declare 'ext/Math/BigInt/FastCalc/Makefile.old'
> MANIFEST did not declare 'ext/Math/BigInt/FastCalc/blib/bin/.exists'
> MANIFEST did not declare 'ext/Math/BigInt/FastCalc/blib/man1/.exists'
> MANIFEST did not declare 'ext/Math/BigInt/FastCalc/blib/man3/.exists'
> MANIFEST did not declare 'ext/Math/BigInt/FastCalc/blib/script/.exists'
> MANIFEST did not declare 'ext/Math/BigInt/FastCalc/pm_to_blib'
> MANIFEST did not declare 'ext/NDBM_File/Makefile'
> MANIFEST did not declare 'ext/NDBM_File/Makefile.old'
> MANIFEST did not declare 'ext/NDBM_File/NDBM_File.bs'
> MANIFEST did not declare 'ext/NDBM_File/NDBM_File.c'
> MANIFEST did not declare 'ext/NDBM_File/NDBM_File.o'
> MANIFEST did not declare 'ext/NDBM_File/blib/bin/.exists'
> MANIFEST did not declare 'ext/NDBM_File/blib/man1/.exists'
> MANIFEST did not declare 'ext/NDBM_File/blib/man3/.exists'
> MANIFEST did not declare 'ext/NDBM_File/blib/script/.exists'
> MANIFEST did not declare 'ext/NDBM_File/pm_to_blib'
> MANIFEST did not declare 'ext/ODBM_File/Makefile'
> MANIFEST did not declare 'ext/ODBM_File/Makefile.old'
> MANIFEST did not declare 'ext/ODBM_File/ODBM_File.bs'
> MANIFEST did not declare 'ext/ODBM_File/ODBM_File.c'
> MANIFEST did not declare 'ext/ODBM_File/ODBM_File.o'
> MANIFEST did not declare 'ext/ODBM_File/blib/bin/.exists'
> MANIFEST did not declare 'ext/ODBM_File/blib/man1/.exists'
> MANIFEST did not declare 'ext/ODBM_File/blib/man3/.exists'
> MANIFEST did not declare 'ext/ODBM_File/blib/script/.exists'
> MANIFEST did not declare 'ext/ODBM_File/pm_to_blib'
> MANIFEST did not declare 'ext/Opcode/Makefile'
> MANIFEST did not declare 'ext/Opcode/Makefile.old'
> MANIFEST did not declare 'ext/Opcode/Opcode.bs'
> MANIFEST did not declare 'ext/Opcode/Opcode.c'
> MANIFEST did not declare 'ext/Opcode/Opcode.o'
> MANIFEST did not declare 'ext/Opcode/blib/bin/.exists'
> MANIFEST did not declare 'ext/Opcode/blib/man1/.exists'
> MANIFEST did not declare 'ext/Opcode/blib/man3/.exists'
> MANIFEST did not declare 'ext/Opcode/blib/script/.exists'
> MANIFEST did not declare 'ext/Opcode/pm_to_blib'
> MANIFEST did not declare 'ext/POSIX/Makefile'
> MANIFEST did not declare 'ext/POSIX/Makefile.old'
> MANIFEST did not declare 'ext/POSIX/POSIX.bs'
> MANIFEST did not declare 'ext/POSIX/POSIX.c'
> MANIFEST did not declare 'ext/POSIX/POSIX.o'
> MANIFEST did not declare 'ext/POSIX/blib/bin/.exists'
> MANIFEST did not declare 'ext/POSIX/blib/man1/.exists'
> MANIFEST did not declare 'ext/POSIX/blib/man3/.exists'
> MANIFEST did not declare 'ext/POSIX/blib/script/.exists'
> MANIFEST did not declare 'ext/POSIX/const-c.inc'
> MANIFEST did not declare 'ext/POSIX/const-xs.inc'
> MANIFEST did not declare 'ext/POSIX/pm_to_blib'
> MANIFEST did not declare 'ext/PerlIO/encoding/Makefile'
> MANIFEST did not declare 'ext/PerlIO/encoding/Makefile.old'
> MANIFEST did not declare 'ext/PerlIO/encoding/blib/bin/.exists'
> MANIFEST did not declare 'ext/PerlIO/encoding/blib/man1/.exists'
> MANIFEST did not declare 'ext/PerlIO/encoding/blib/man3/.exists'
> MANIFEST did not declare 'ext/PerlIO/encoding/blib/script/.exists'
> MANIFEST did not declare 'ext/PerlIO/encoding/encoding.bs'
> MANIFEST did not declare 'ext/PerlIO/encoding/encoding.c'
> MANIFEST did not declare 'ext/PerlIO/encoding/encoding.o'
> MANIFEST did not declare 'ext/PerlIO/encoding/pm_to_blib'
> MANIFEST did not declare 'ext/PerlIO/scalar/Makefile'
> MANIFEST did not declare 'ext/PerlIO/scalar/Makefile.old'
> MANIFEST did not declare 'ext/PerlIO/scalar/blib/bin/.exists'
> MANIFEST did not declare 'ext/PerlIO/scalar/blib/man1/.exists'
> MANIFEST did not declare 'ext/PerlIO/scalar/blib/man3/.exists'
> MANIFEST did not declare 'ext/PerlIO/scalar/blib/script/.exists'
> MANIFEST did not declare 'ext/PerlIO/scalar/pm_to_blib'
> MANIFEST did not declare 'ext/PerlIO/scalar/scalar.bs'
> MANIFEST did not declare 'ext/PerlIO/scalar/scalar.c'
> MANIFEST did not declare 'ext/PerlIO/scalar/scalar.o'
> MANIFEST did not declare 'ext/PerlIO/via/Makefile'
> MANIFEST did not declare 'ext/PerlIO/via/Makefile.old'
> MANIFEST did not declare 'ext/PerlIO/via/blib/bin/.exists'
> MANIFEST did not declare 'ext/PerlIO/via/blib/man1/.exists'
> MANIFEST did not declare 'ext/PerlIO/via/blib/man3/.exists'
> MANIFEST did not declare 'ext/PerlIO/via/blib/script/.exists'
> MANIFEST did not declare 'ext/PerlIO/via/pm_to_blib'
> MANIFEST did not declare 'ext/PerlIO/via/via.bs'
> MANIFEST did not declare 'ext/PerlIO/via/via.c'
> MANIFEST did not declare 'ext/PerlIO/via/via.o'
> MANIFEST did not declare 'ext/SDBM_File/Makefile'
> MANIFEST did not declare 'ext/SDBM_File/Makefile.old'
> MANIFEST did not declare 'ext/SDBM_File/SDBM_File.bs'
> MANIFEST did not declare 'ext/SDBM_File/SDBM_File.c'
> MANIFEST did not declare 'ext/SDBM_File/SDBM_File.o'
> MANIFEST did not declare 'ext/SDBM_File/blib/bin/.exists'
> MANIFEST did not declare 'ext/SDBM_File/blib/man1/.exists'
> MANIFEST did not declare 'ext/SDBM_File/blib/man3/.exists'
> MANIFEST did not declare 'ext/SDBM_File/blib/script/.exists'
> MANIFEST did not declare 'ext/SDBM_File/pm_to_blib'
> MANIFEST did not declare 'ext/SDBM_File/sdbm/Makefile'
> MANIFEST did not declare 'ext/SDBM_File/sdbm/Makefile.old'
> MANIFEST did not declare 'ext/SDBM_File/sdbm/hash.o'
> MANIFEST did not declare 'ext/SDBM_File/sdbm/libsdbm.a'
> MANIFEST did not declare 'ext/SDBM_File/sdbm/pair.o'
> MANIFEST did not declare 'ext/SDBM_File/sdbm/sdbm.o'
> MANIFEST did not declare 'ext/Socket/Makefile'
> MANIFEST did not declare 'ext/Socket/Makefile.old'
> MANIFEST did not declare 'ext/Socket/Socket.bs'
> MANIFEST did not declare 'ext/Socket/Socket.c'
> MANIFEST did not declare 'ext/Socket/Socket.o'
> MANIFEST did not declare 'ext/Socket/blib/bin/.exists'
> MANIFEST did not declare 'ext/Socket/blib/man1/.exists'
> MANIFEST did not declare 'ext/Socket/blib/man3/.exists'
> MANIFEST did not declare 'ext/Socket/blib/script/.exists'
> MANIFEST did not declare 'ext/Socket/const-c.inc'
> MANIFEST did not declare 'ext/Socket/const-xs.inc'
> MANIFEST did not declare 'ext/Socket/pm_to_blib'
> MANIFEST did not declare 'ext/Storable/Makefile'
> MANIFEST did not declare 'ext/Storable/Makefile.old'
> MANIFEST did not declare 'ext/Storable/Storable.bs'
> MANIFEST did not declare 'ext/Storable/Storable.c'
> MANIFEST did not declare 'ext/Storable/Storable.o'
> MANIFEST did not declare 'ext/Storable/blib/bin/.exists'
> MANIFEST did not declare 'ext/Storable/blib/man1/.exists'
> MANIFEST did not declare 'ext/Storable/blib/man3/.exists'
> MANIFEST did not declare 'ext/Storable/blib/script/.exists'
> MANIFEST did not declare 'ext/Storable/pm_to_blib'
> MANIFEST did not declare 'ext/Sys/Hostname/Hostname.bs'
> MANIFEST did not declare 'ext/Sys/Hostname/Hostname.c'
> MANIFEST did not declare 'ext/Sys/Hostname/Hostname.o'
> MANIFEST did not declare 'ext/Sys/Hostname/Makefile'
> MANIFEST did not declare 'ext/Sys/Hostname/Makefile.old'
> MANIFEST did not declare 'ext/Sys/Hostname/blib/bin/.exists'
> MANIFEST did not declare 'ext/Sys/Hostname/blib/man1/.exists'
> MANIFEST did not declare 'ext/Sys/Hostname/blib/man3/.exists'
> MANIFEST did not declare 'ext/Sys/Hostname/blib/script/.exists'
> MANIFEST did not declare 'ext/Sys/Hostname/pm_to_blib'
> MANIFEST did not declare 'ext/Sys/Syslog/Makefile'
> MANIFEST did not declare 'ext/Sys/Syslog/Makefile.old'
> MANIFEST did not declare 'ext/Sys/Syslog/Syslog.bs'
> MANIFEST did not declare 'ext/Sys/Syslog/Syslog.c'
> MANIFEST did not declare 'ext/Sys/Syslog/Syslog.o'
> MANIFEST did not declare 'ext/Sys/Syslog/blib/bin/.exists'
> MANIFEST did not declare 'ext/Sys/Syslog/blib/man1/.exists'
> MANIFEST did not declare 'ext/Sys/Syslog/blib/man3/.exists'
> MANIFEST did not declare 'ext/Sys/Syslog/blib/script/.exists'
> MANIFEST did not declare 'ext/Sys/Syslog/const-c.inc'
> MANIFEST did not declare 'ext/Sys/Syslog/const-xs.inc'
> MANIFEST did not declare 'ext/Sys/Syslog/macros.all'
> MANIFEST did not declare 'ext/Sys/Syslog/pm_to_blib'
> MANIFEST did not declare 'ext/Text/Soundex/Makefile'
> MANIFEST did not declare 'ext/Text/Soundex/Makefile.old'
> MANIFEST did not declare 'ext/Text/Soundex/Soundex.bs'
> MANIFEST did not declare 'ext/Text/Soundex/Soundex.c'
> MANIFEST did not declare 'ext/Text/Soundex/Soundex.o'
> MANIFEST did not declare 'ext/Text/Soundex/blib/bin/.exists'
> MANIFEST did not declare 'ext/Text/Soundex/blib/man1/.exists'
> MANIFEST did not declare 'ext/Text/Soundex/blib/man3/.exists'
> MANIFEST did not declare 'ext/Text/Soundex/blib/script/.exists'
> MANIFEST did not declare 'ext/Text/Soundex/pm_to_blib'
> MANIFEST did not declare 'ext/Time/HiRes/HiRes.bs'
> MANIFEST did not declare 'ext/Time/HiRes/HiRes.c'
> MANIFEST did not declare 'ext/Time/HiRes/HiRes.o'
> MANIFEST did not declare 'ext/Time/HiRes/Makefile'
> MANIFEST did not declare 'ext/Time/HiRes/Makefile.old'
> MANIFEST did not declare 'ext/Time/HiRes/blib/bin/.exists'
> MANIFEST did not declare 'ext/Time/HiRes/blib/man1/.exists'
> MANIFEST did not declare 'ext/Time/HiRes/blib/man3/.exists'
> MANIFEST did not declare 'ext/Time/HiRes/blib/script/.exists'
> MANIFEST did not declare 'ext/Time/HiRes/const-c.inc'
> MANIFEST did not declare 'ext/Time/HiRes/const-xs.inc'
> MANIFEST did not declare 'ext/Time/HiRes/pm_to_blib'
> MANIFEST did not declare 'ext/Time/HiRes/ppport.h'
> MANIFEST did not declare 'ext/Time/HiRes/xdefine'
> MANIFEST did not declare 'ext/Time/Piece/Makefile'
> MANIFEST did not declare 'ext/Time/Piece/Makefile.old'
> MANIFEST did not declare 'ext/Time/Piece/Piece.bs'
> MANIFEST did not declare 'ext/Time/Piece/Piece.c'
> MANIFEST did not declare 'ext/Time/Piece/Piece.o'
> MANIFEST did not declare 'ext/Time/Piece/blib/bin/.exists'
> MANIFEST did not declare 'ext/Time/Piece/blib/man1/.exists'
> MANIFEST did not declare 'ext/Time/Piece/blib/man3/.exists'
> MANIFEST did not declare 'ext/Time/Piece/blib/script/.exists'
> MANIFEST did not declare 'ext/Time/Piece/pm_to_blib'
> MANIFEST did not declare 'ext/Unicode/Normalize/Makefile'
> MANIFEST did not declare 'ext/Unicode/Normalize/Makefile.old'
> MANIFEST did not declare 'ext/Unicode/Normalize/Normalize.bs'
> MANIFEST did not declare 'ext/Unicode/Normalize/Normalize.c'
> MANIFEST did not declare 'ext/Unicode/Normalize/Normalize.o'
> MANIFEST did not declare 'ext/Unicode/Normalize/blib/bin/.exists'
> MANIFEST did not declare 'ext/Unicode/Normalize/blib/man1/.exists'
> MANIFEST did not declare 'ext/Unicode/Normalize/blib/man3/.exists'
> MANIFEST did not declare 'ext/Unicode/Normalize/blib/script/.exists'
> MANIFEST did not declare 'ext/Unicode/Normalize/pm_to_blib'
> MANIFEST did not declare 'ext/Unicode/Normalize/unfcan.h'
> MANIFEST did not declare 'ext/Unicode/Normalize/unfcmb.h'
> MANIFEST did not declare 'ext/Unicode/Normalize/unfcmp.h'
> MANIFEST did not declare 'ext/Unicode/Normalize/unfcpt.h'
> MANIFEST did not declare 'ext/Unicode/Normalize/unfexc.h'
> MANIFEST did not declare 'ext/Win32API/File/ppport.h'
> MANIFEST did not declare 'ext/XS/APItest/APItest.bs'
> MANIFEST did not declare 'ext/XS/APItest/APItest.c'
> MANIFEST did not declare 'ext/XS/APItest/APItest.o'
> MANIFEST did not declare 'ext/XS/APItest/Makefile'
> MANIFEST did not declare 'ext/XS/APItest/Makefile.old'
> MANIFEST did not declare 'ext/XS/APItest/blib/bin/.exists'
> MANIFEST did not declare 'ext/XS/APItest/blib/man1/.exists'
> MANIFEST did not declare 'ext/XS/APItest/blib/man3/.exists'
> MANIFEST did not declare 'ext/XS/APItest/blib/script/.exists'
> MANIFEST did not declare 'ext/XS/APItest/core.o'
> MANIFEST did not declare 'ext/XS/APItest/exception.o'
> MANIFEST did not declare 'ext/XS/APItest/notcore.o'
> MANIFEST did not declare 'ext/XS/APItest/pm_to_blib'
> MANIFEST did not declare 'ext/XS/Typemap/Makefile'
> MANIFEST did not declare 'ext/XS/Typemap/Makefile.old'
> MANIFEST did not declare 'ext/XS/Typemap/Typemap.bs'
> MANIFEST did not declare 'ext/XS/Typemap/Typemap.c'
> MANIFEST did not declare 'ext/XS/Typemap/Typemap.o'
> MANIFEST did not declare 'ext/XS/Typemap/blib/bin/.exists'
> MANIFEST did not declare 'ext/XS/Typemap/blib/man1/.exists'
> MANIFEST did not declare 'ext/XS/Typemap/blib/man3/.exists'
> MANIFEST did not declare 'ext/XS/Typemap/blib/script/.exists'
> MANIFEST did not declare 'ext/XS/Typemap/pm_to_blib'
> MANIFEST did not declare 'ext/XS/Typemap/stdio.o'
> MANIFEST did not declare 'ext/attrs/Makefile'
> MANIFEST did not declare 'ext/attrs/Makefile.old'
> MANIFEST did not declare 'ext/attrs/attrs.bs'
> MANIFEST did not declare 'ext/attrs/attrs.c'
> MANIFEST did not declare 'ext/attrs/attrs.o'
> MANIFEST did not declare 'ext/attrs/blib/bin/.exists'
> MANIFEST did not declare 'ext/attrs/blib/man1/.exists'
> MANIFEST did not declare 'ext/attrs/blib/man3/.exists'
> MANIFEST did not declare 'ext/attrs/blib/script/.exists'
> MANIFEST did not declare 'ext/attrs/pm_to_blib'
> MANIFEST did not declare 'ext/re/Makefile'
> MANIFEST did not declare 'ext/re/Makefile.old'
> MANIFEST did not declare 'ext/re/blib/bin/.exists'
> MANIFEST did not declare 'ext/re/blib/man1/.exists'
> MANIFEST did not declare 'ext/re/blib/man3/.exists'
> MANIFEST did not declare 'ext/re/blib/script/.exists'
> MANIFEST did not declare 'ext/re/pm_to_blib'
> MANIFEST did not declare 'ext/re/re.bs'
> MANIFEST did not declare 'ext/re/re.c'
> MANIFEST did not declare 'ext/re/re.o'
> MANIFEST did not declare 'ext/re/re_comp.c'
> MANIFEST did not declare 'ext/re/re_comp.o'
> MANIFEST did not declare 'ext/re/re_exec.c'
> MANIFEST did not declare 'ext/re/re_exec.o'
> MANIFEST did not declare 'ext/threads/Makefile'
> MANIFEST did not declare 'ext/threads/Makefile.old'
> MANIFEST did not declare 'ext/threads/blib/bin/.exists'
> MANIFEST did not declare 'ext/threads/blib/man1/.exists'
> MANIFEST did not declare 'ext/threads/blib/man3/.exists'
> MANIFEST did not declare 'ext/threads/blib/script/.exists'
> MANIFEST did not declare 'ext/threads/pm_to_blib'
> MANIFEST did not declare 'ext/threads/shared/Makefile'
> MANIFEST did not declare 'ext/threads/shared/Makefile.old'
> MANIFEST did not declare 'ext/threads/shared/blib/bin/.exists'
> MANIFEST did not declare 'ext/threads/shared/blib/man1/.exists'
> MANIFEST did not declare 'ext/threads/shared/blib/man3/.exists'
> MANIFEST did not declare 'ext/threads/shared/blib/script/.exists'
> MANIFEST did not declare 'ext/threads/shared/pm_to_blib'
> MANIFEST did not declare 'ext/threads/shared/shared.bs'
> MANIFEST did not declare 'ext/threads/shared/shared.c'
> MANIFEST did not declare 'ext/threads/shared/shared.o'
> MANIFEST did not declare 'ext/threads/threads.bs'
> MANIFEST did not declare 'ext/threads/threads.c'
> MANIFEST did not declare 'ext/threads/threads.o'
> MANIFEST did not declare 'lib/.exists'
> MANIFEST did not declare 'lib/CPANPLUS/Dist/Build/t/dummy-cpanplus/5.9.5/build/Foo-Bar-0.01/Build.PL'
> MANIFEST did not declare 'lib/CPANPLUS/Dist/Build/t/dummy-cpanplus/5.9.5/build/Foo-Bar-0.01/CHANGES'
> MANIFEST did not declare 'lib/CPANPLUS/Dist/Build/t/dummy-cpanplus/5.9.5/build/Foo-Bar-0.01/MANIFEST'
> MANIFEST did not declare 'lib/CPANPLUS/Dist/Build/t/dummy-cpanplus/5.9.5/build/Foo-Bar-0.01/README'
> MANIFEST did not declare 'lib/CPANPLUS/Dist/Build/t/dummy-cpanplus/5.9.5/build/Foo-Bar-0.01/bin/foobar.pl'
> MANIFEST did not declare 'lib/CPANPLUS/Dist/Build/t/dummy-cpanplus/5.9.5/build/Foo-Bar-0.01/lib/Foo/Bar.pm'
> MANIFEST did not declare 'lib/CPANPLUS/Dist/Build/t/dummy-cpanplus/5.9.5/build/Foo-Bar-0.01/test.pl'
> MANIFEST did not declare 'lib/Compress/.exists'
> MANIFEST did not declare 'lib/Compress/Raw/.exists'
> MANIFEST did not declare 'lib/Compress/Zlib.pm'
> MANIFEST did not declare 'lib/Config.pm'
> MANIFEST did not declare 'lib/Config.pod'
> MANIFEST did not declare 'lib/Config_heavy.pl'
> MANIFEST did not declare 'lib/Data/.exists'
> MANIFEST did not declare 'lib/Devel/.exists'
> MANIFEST did not declare 'lib/Devel/DProf.pm'
> MANIFEST did not declare 'lib/Devel/PPPort.pm'
> MANIFEST did not declare 'lib/Devel/Peek.pm'
> MANIFEST did not declare 'lib/Digest/.exists'
> MANIFEST did not declare 'lib/Digest/MD5.pm'
> MANIFEST did not declare 'lib/Digest/SHA.pm'
> MANIFEST did not declare 'lib/Encode.pm'
> MANIFEST did not declare 'lib/Encode/.exists'
> MANIFEST did not declare 'lib/Encode/Alias.pm'
> MANIFEST did not declare 'lib/Encode/Byte.pm'
> MANIFEST did not declare 'lib/Encode/CJKConstants.pm'
> MANIFEST did not declare 'lib/Encode/CN.pm'
> MANIFEST did not declare 'lib/Encode/CN/HZ.pm'
> MANIFEST did not declare 'lib/Encode/Changes.e2x'
> MANIFEST did not declare 'lib/Encode/Config.pm'
> MANIFEST did not declare 'lib/Encode/ConfigLocal_PM.e2x'
> MANIFEST did not declare 'lib/Encode/EBCDIC.pm'
> MANIFEST did not declare 'lib/Encode/Encoder.pm'
> MANIFEST did not declare 'lib/Encode/Encoding.pm'
> MANIFEST did not declare 'lib/Encode/GSM0338.pm'
> MANIFEST did not declare 'lib/Encode/Guess.pm'
> MANIFEST did not declare 'lib/Encode/JP.pm'
> MANIFEST did not declare 'lib/Encode/JP/H2Z.pm'
> MANIFEST did not declare 'lib/Encode/JP/JIS7.pm'
> MANIFEST did not declare 'lib/Encode/KR.pm'
> MANIFEST did not declare 'lib/Encode/KR/2022_KR.pm'
> MANIFEST did not declare 'lib/Encode/MIME/Header.pm'
> MANIFEST did not declare 'lib/Encode/MIME/Header/ISO_2022_JP.pm'
> MANIFEST did not declare 'lib/Encode/MIME/Name.pm'
> MANIFEST did not declare 'lib/Encode/Makefile_PL.e2x'
> MANIFEST did not declare 'lib/Encode/PerlIO.pod'
> MANIFEST did not declare 'lib/Encode/README.e2x'
> MANIFEST did not declare 'lib/Encode/Supported.pod'
> MANIFEST did not declare 'lib/Encode/Symbol.pm'
> MANIFEST did not declare 'lib/Encode/TW.pm'
> MANIFEST did not declare 'lib/Encode/Unicode.pm'
> MANIFEST did not declare 'lib/Encode/Unicode/UTF7.pm'
> MANIFEST did not declare 'lib/Encode/_PM.e2x'
> MANIFEST did not declare 'lib/Encode/_T.e2x'
> MANIFEST did not declare 'lib/Encode/encode.h'
> MANIFEST did not declare 'lib/Errno.pm'
> MANIFEST did not declare 'lib/ExtUtils/Miniperl.pm'
> MANIFEST did not declare 'lib/ExtUtils/ParseXS/t/XSTest.so'
> MANIFEST did not declare 'lib/Fcntl.pm'
> MANIFEST did not declare 'lib/File/.exists'
> MANIFEST did not declare 'lib/File/Glob.pm'
> MANIFEST did not declare 'lib/File/GlobMapper.pm'
> MANIFEST did not declare 'lib/Filter/Util/.exists'
> MANIFEST did not declare 'lib/Filter/Util/Call.pm'
> MANIFEST did not declare 'lib/GDBM_File.pm'
> MANIFEST did not declare 'lib/Hash/.exists'
> MANIFEST did not declare 'lib/Hash/Util.pm'
> MANIFEST did not declare 'lib/Hash/Util/.exists'
> MANIFEST did not declare 'lib/Hash/Util/FieldHash.pm'
> MANIFEST did not declare 'lib/I18N/.exists'
> MANIFEST did not declare 'lib/I18N/Langinfo.pm'
> MANIFEST did not declare 'lib/IO.pm'
> MANIFEST did not declare 'lib/IO/Compress/.exists'
> MANIFEST did not declare 'lib/IO/Compress/Adapter/Deflate.pm'
> MANIFEST did not declare 'lib/IO/Compress/Adapter/Identity.pm'
> MANIFEST did not declare 'lib/IO/Compress/Base.pm'
> MANIFEST did not declare 'lib/IO/Compress/Base/Common.pm'
> MANIFEST did not declare 'lib/IO/Compress/Deflate.pm'
> MANIFEST did not declare 'lib/IO/Compress/Gzip.pm'
> MANIFEST did not declare 'lib/IO/Compress/Gzip/Constants.pm'
> MANIFEST did not declare 'lib/IO/Compress/RawDeflate.pm'
> MANIFEST did not declare 'lib/IO/Compress/Zip.pm'
> MANIFEST did not declare 'lib/IO/Compress/Zip/Constants.pm'
> MANIFEST did not declare 'lib/IO/Compress/Zlib/Constants.pm'
> MANIFEST did not declare 'lib/IO/Compress/Zlib/Extra.pm'
> MANIFEST did not declare 'lib/IO/Dir.pm'
> MANIFEST did not declare 'lib/IO/File.pm'
> MANIFEST did not declare 'lib/IO/Handle.pm'
> MANIFEST did not declare 'lib/IO/Pipe.pm'
> MANIFEST did not declare 'lib/IO/Poll.pm'
> MANIFEST did not declare 'lib/IO/Seekable.pm'
> MANIFEST did not declare 'lib/IO/Select.pm'
> MANIFEST did not declare 'lib/IO/Socket.pm'
> MANIFEST did not declare 'lib/IO/Socket/INET.pm'
> MANIFEST did not declare 'lib/IO/Socket/UNIX.pm'
> MANIFEST did not declare 'lib/IO/Uncompress/Adapter/Identity.pm'
> MANIFEST did not declare 'lib/IO/Uncompress/Adapter/Inflate.pm'
> MANIFEST did not declare 'lib/IO/Uncompress/AnyInflate.pm'
> MANIFEST did not declare 'lib/IO/Uncompress/AnyUncompress.pm'
> MANIFEST did not declare 'lib/IO/Uncompress/Base.pm'
> MANIFEST did not declare 'lib/IO/Uncompress/Gunzip.pm'
> MANIFEST did not declare 'lib/IO/Uncompress/Inflate.pm'
> MANIFEST did not declare 'lib/IO/Uncompress/RawInflate.pm'
> MANIFEST did not declare 'lib/IO/Uncompress/Unzip.pm'
> MANIFEST did not declare 'lib/IPC/.exists'
> MANIFEST did not declare 'lib/IPC/Msg.pm'
> MANIFEST did not declare 'lib/IPC/Semaphore.pm'
> MANIFEST did not declare 'lib/IPC/SysV.pm'
> MANIFEST did not declare 'lib/List/.exists'
> MANIFEST did not declare 'lib/List/Util.pm'
> MANIFEST did not declare 'lib/MIME/.exists'
> MANIFEST did not declare 'lib/MIME/Base64.pm'
> MANIFEST did not declare 'lib/MIME/QuotedPrint.pm'
> MANIFEST did not declare 'lib/Math/BigInt/.exists'
> MANIFEST did not declare 'lib/Math/BigInt/FastCalc.pm'
> MANIFEST did not declare 'lib/NDBM_File.pm'
> MANIFEST did not declare 'lib/ODBM_File.pm'
> MANIFEST did not declare 'lib/Opcode.pm'
> MANIFEST did not declare 'lib/POSIX.pm'
> MANIFEST did not declare 'lib/POSIX.pod'
> MANIFEST did not declare 'lib/PerlIO/.exists'
> MANIFEST did not declare 'lib/PerlIO/encoding.pm'
> MANIFEST did not declare 'lib/PerlIO/scalar.pm'
> MANIFEST did not declare 'lib/PerlIO/via.pm'
> MANIFEST did not declare 'lib/SDBM_File.pm'
> MANIFEST did not declare 'lib/Safe.pm'
> MANIFEST did not declare 'lib/Scalar/Util.pm'
> MANIFEST did not declare 'lib/Socket.pm'
> MANIFEST did not declare 'lib/Storable.pm'
> MANIFEST did not declare 'lib/Sys/.exists'
> MANIFEST did not declare 'lib/Sys/Hostname.pm'
> MANIFEST did not declare 'lib/Sys/Syslog.pm'
> MANIFEST did not declare 'lib/Text/.exists'
> MANIFEST did not declare 'lib/Text/Soundex.pm'
> MANIFEST did not declare 'lib/Time/.exists'
> MANIFEST did not declare 'lib/Time/HiRes.pm'
> MANIFEST did not declare 'lib/Time/Piece.pm'
> MANIFEST did not declare 'lib/Time/Seconds.pm'
> MANIFEST did not declare 'lib/Unicode/.exists'
> MANIFEST did not declare 'lib/Unicode/Normalize.pm'
> MANIFEST did not declare 'lib/XS/.exists'
> MANIFEST did not declare 'lib/XS/APItest.pm'
> MANIFEST did not declare 'lib/XS/Typemap.pm'
> MANIFEST did not declare 'lib/attrs.pm'
> MANIFEST did not declare 'lib/auto/Compress/Zlib/.exists'
> MANIFEST did not declare 'lib/auto/Compress/Zlib/autosplit.ix'
> MANIFEST did not declare 'lib/auto/Devel/DProf/.exists'
> MANIFEST did not declare 'lib/auto/Devel/DProf/DProf.bs'
> MANIFEST did not declare 'lib/auto/Devel/DProf/DProf.so'
> MANIFEST did not declare 'lib/auto/Devel/PPPort/.exists'
> MANIFEST did not declare 'lib/auto/Devel/PPPort/PPPort.bs'
> MANIFEST did not declare 'lib/auto/Devel/PPPort/PPPort.so'
> MANIFEST did not declare 'lib/auto/Devel/Peek/.exists'
> MANIFEST did not declare 'lib/auto/Devel/Peek/Peek.bs'
> MANIFEST did not declare 'lib/auto/Devel/Peek/Peek.so'
> MANIFEST did not declare 'lib/auto/Digest/MD5/.exists'
> MANIFEST did not declare 'lib/auto/Digest/MD5/MD5.bs'
> MANIFEST did not declare 'lib/auto/Digest/MD5/MD5.so'
> MANIFEST did not declare 'lib/auto/Digest/SHA/.exists'
> MANIFEST did not declare 'lib/auto/Digest/SHA/SHA.bs'
> MANIFEST did not declare 'lib/auto/Digest/SHA/SHA.so'
> MANIFEST did not declare 'lib/auto/Encode/.exists'
> MANIFEST did not declare 'lib/auto/Encode/Byte/.exists'
> MANIFEST did not declare 'lib/auto/Encode/Byte/Byte.bs'
> MANIFEST did not declare 'lib/auto/Encode/Byte/Byte.so'
> MANIFEST did not declare 'lib/auto/Encode/CN/.exists'
> MANIFEST did not declare 'lib/auto/Encode/CN/CN.bs'
> MANIFEST did not declare 'lib/auto/Encode/CN/CN.so'
> MANIFEST did not declare 'lib/auto/Encode/EBCDIC/.exists'
> MANIFEST did not declare 'lib/auto/Encode/EBCDIC/EBCDIC.bs'
> MANIFEST did not declare 'lib/auto/Encode/EBCDIC/EBCDIC.so'
> MANIFEST did not declare 'lib/auto/Encode/Encode.bs'
> MANIFEST did not declare 'lib/auto/Encode/Encode.so'
> MANIFEST did not declare 'lib/auto/Encode/JP/.exists'
> MANIFEST did not declare 'lib/auto/Encode/JP/JP.bs'
> MANIFEST did not declare 'lib/auto/Encode/JP/JP.so'
> MANIFEST did not declare 'lib/auto/Encode/KR/.exists'
> MANIFEST did not declare 'lib/auto/Encode/KR/KR.bs'
> MANIFEST did not declare 'lib/auto/Encode/KR/KR.so'
> MANIFEST did not declare 'lib/auto/Encode/Symbol/.exists'
> MANIFEST did not declare 'lib/auto/Encode/Symbol/Symbol.bs'
> MANIFEST did not declare 'lib/auto/Encode/Symbol/Symbol.so'
> MANIFEST did not declare 'lib/auto/Encode/TW/.exists'
> MANIFEST did not declare 'lib/auto/Encode/TW/TW.bs'
> MANIFEST did not declare 'lib/auto/Encode/TW/TW.so'
> MANIFEST did not declare 'lib/auto/Encode/Unicode/.exists'
> MANIFEST did not declare 'lib/auto/Encode/Unicode/Unicode.bs'
> MANIFEST did not declare 'lib/auto/Encode/Unicode/Unicode.so'
> MANIFEST did not declare 'lib/auto/Errno/.exists'
> MANIFEST did not declare 'lib/auto/Fcntl/.exists'
> MANIFEST did not declare 'lib/auto/Fcntl/Fcntl.bs'
> MANIFEST did not declare 'lib/auto/Fcntl/Fcntl.so'
> MANIFEST did not declare 'lib/auto/File/Glob/.exists'
> MANIFEST did not declare 'lib/auto/File/Glob/Glob.bs'
> MANIFEST did not declare 'lib/auto/File/Glob/Glob.so'
> MANIFEST did not declare 'lib/auto/Filter/Util/Call/.exists'
> MANIFEST did not declare 'lib/auto/Filter/Util/Call/Call.bs'
> MANIFEST did not declare 'lib/auto/Filter/Util/Call/Call.so'
> MANIFEST did not declare 'lib/auto/GDBM_File/.exists'
> MANIFEST did not declare 'lib/auto/GDBM_File/GDBM_File.bs'
> MANIFEST did not declare 'lib/auto/GDBM_File/GDBM_File.so'
> MANIFEST did not declare 'lib/auto/Hash/Util/.exists'
> MANIFEST did not declare 'lib/auto/Hash/Util/FieldHash/.exists'
> MANIFEST did not declare 'lib/auto/Hash/Util/FieldHash/FieldHash.bs'
> MANIFEST did not declare 'lib/auto/Hash/Util/FieldHash/FieldHash.so'
> MANIFEST did not declare 'lib/auto/Hash/Util/Util.bs'
> MANIFEST did not declare 'lib/auto/Hash/Util/Util.so'
> MANIFEST did not declare 'lib/auto/I18N/Langinfo/.exists'
> MANIFEST did not declare 'lib/auto/I18N/Langinfo/Langinfo.bs'
> MANIFEST did not declare 'lib/auto/I18N/Langinfo/Langinfo.so'
> MANIFEST did not declare 'lib/auto/I18N/Langinfo/autosplit.ix'
> MANIFEST did not declare 'lib/auto/IO/.exists'
> MANIFEST did not declare 'lib/auto/IO/Compress/Base/.exists'
> MANIFEST did not declare 'lib/auto/IO/Compress/Zlib/.exists'
> MANIFEST did not declare 'lib/auto/IO/IO.bs'
> MANIFEST did not declare 'lib/auto/IO/IO.so'
> MANIFEST did not declare 'lib/auto/IPC/SysV/.exists'
> MANIFEST did not declare 'lib/auto/IPC/SysV/SysV.bs'
> MANIFEST did not declare 'lib/auto/IPC/SysV/SysV.so'
> MANIFEST did not declare 'lib/auto/List/Util/.exists'
> MANIFEST did not declare 'lib/auto/List/Util/Util.bs'
> MANIFEST did not declare 'lib/auto/List/Util/Util.so'
> MANIFEST did not declare 'lib/auto/MIME/Base64/.exists'
> MANIFEST did not declare 'lib/auto/MIME/Base64/Base64.bs'
> MANIFEST did not declare 'lib/auto/MIME/Base64/Base64.so'
> MANIFEST did not declare 'lib/auto/Math/BigInt/FastCalc/.exists'
> MANIFEST did not declare 'lib/auto/Math/BigInt/FastCalc/FastCalc.bs'
> MANIFEST did not declare 'lib/auto/Math/BigInt/FastCalc/FastCalc.so'
> MANIFEST did not declare 'lib/auto/NDBM_File/.exists'
> MANIFEST did not declare 'lib/auto/NDBM_File/NDBM_File.bs'
> MANIFEST did not declare 'lib/auto/NDBM_File/NDBM_File.so'
> MANIFEST did not declare 'lib/auto/ODBM_File/.exists'
> MANIFEST did not declare 'lib/auto/ODBM_File/ODBM_File.bs'
> MANIFEST did not declare 'lib/auto/ODBM_File/ODBM_File.so'
> MANIFEST did not declare 'lib/auto/Opcode/.exists'
> MANIFEST did not declare 'lib/auto/Opcode/Opcode.bs'
> MANIFEST did not declare 'lib/auto/Opcode/Opcode.so'
> MANIFEST did not declare 'lib/auto/POSIX/.exists'
> MANIFEST did not declare 'lib/auto/POSIX/POSIX.bs'
> MANIFEST did not declare 'lib/auto/POSIX/POSIX.so'
> MANIFEST did not declare 'lib/auto/POSIX/SigAction/flags.al'
> MANIFEST did not declare 'lib/auto/POSIX/SigAction/handler.al'
> MANIFEST did not declare 'lib/auto/POSIX/SigAction/mask.al'
> MANIFEST did not declare 'lib/auto/POSIX/SigAction/new.al'
> MANIFEST did not declare 'lib/auto/POSIX/SigAction/safe.al'
> MANIFEST did not declare 'lib/auto/POSIX/SigRt/CLEAR.al'
> MANIFEST did not declare 'lib/auto/POSIX/SigRt/DELETE.al'
> MANIFEST did not declare 'lib/auto/POSIX/SigRt/EXISTS.al'
> MANIFEST did not declare 'lib/auto/POSIX/SigRt/FETCH.al'
> MANIFEST did not declare 'lib/auto/POSIX/SigRt/SCALAR.al'
> MANIFEST did not declare 'lib/auto/POSIX/SigRt/STORE.al'
> MANIFEST did not declare 'lib/auto/POSIX/SigRt/_check.al'
> MANIFEST did not declare 'lib/auto/POSIX/SigRt/_croak.al'
> MANIFEST did not declare 'lib/auto/POSIX/SigRt/_exist.al'
> MANIFEST did not declare 'lib/auto/POSIX/SigRt/_getsig.al'
> MANIFEST did not declare 'lib/auto/POSIX/SigRt/_init.al'
> MANIFEST did not declare 'lib/auto/POSIX/SigRt/new.al'
> MANIFEST did not declare 'lib/auto/POSIX/abs.al'
> MANIFEST did not declare 'lib/auto/POSIX/alarm.al'
> MANIFEST did not declare 'lib/auto/POSIX/assert.al'
> MANIFEST did not declare 'lib/auto/POSIX/atan2.al'
> MANIFEST did not declare 'lib/auto/POSIX/atexit.al'
> MANIFEST did not declare 'lib/auto/POSIX/atof.al'
> MANIFEST did not declare 'lib/auto/POSIX/atoi.al'
> MANIFEST did not declare 'lib/auto/POSIX/atol.al'
> MANIFEST did not declare 'lib/auto/POSIX/autosplit.ix'
> MANIFEST did not declare 'lib/auto/POSIX/bsearch.al'
> MANIFEST did not declare 'lib/auto/POSIX/calloc.al'
> MANIFEST did not declare 'lib/auto/POSIX/chdir.al'
> MANIFEST did not declare 'lib/auto/POSIX/chmod.al'
> MANIFEST did not declare 'lib/auto/POSIX/chown.al'
> MANIFEST did not declare 'lib/auto/POSIX/clearerr.al'
> MANIFEST did not declare 'lib/auto/POSIX/closedir.al'
> MANIFEST did not declare 'lib/auto/POSIX/cos.al'
> MANIFEST did not declare 'lib/auto/POSIX/creat.al'
> MANIFEST did not declare 'lib/auto/POSIX/div.al'
> MANIFEST did not declare 'lib/auto/POSIX/errno.al'
> MANIFEST did not declare 'lib/auto/POSIX/execl.al'
> MANIFEST did not declare 'lib/auto/POSIX/execle.al'
> MANIFEST did not declare 'lib/auto/POSIX/execlp.al'
> MANIFEST did not declare 'lib/auto/POSIX/execv.al'
> MANIFEST did not declare 'lib/auto/POSIX/execve.al'
> MANIFEST did not declare 'lib/auto/POSIX/execvp.al'
> MANIFEST did not declare 'lib/auto/POSIX/exit.al'
> MANIFEST did not declare 'lib/auto/POSIX/exp.al'
> MANIFEST did not declare 'lib/auto/POSIX/fabs.al'
> MANIFEST did not declare 'lib/auto/POSIX/fclose.al'
> MANIFEST did not declare 'lib/auto/POSIX/fcntl.al'
> MANIFEST did not declare 'lib/auto/POSIX/fdopen.al'
> MANIFEST did not declare 'lib/auto/POSIX/feof.al'
> MANIFEST did not declare 'lib/auto/POSIX/ferror.al'
> MANIFEST did not declare 'lib/auto/POSIX/fflush.al'
> MANIFEST did not declare 'lib/auto/POSIX/fgetc.al'
> MANIFEST did not declare 'lib/auto/POSIX/fgetpos.al'
> MANIFEST did not declare 'lib/auto/POSIX/fgets.al'
> MANIFEST did not declare 'lib/auto/POSIX/fileno.al'
> MANIFEST did not declare 'lib/auto/POSIX/fopen.al'
> MANIFEST did not declare 'lib/auto/POSIX/fork.al'
> MANIFEST did not declare 'lib/auto/POSIX/fprintf.al'
> MANIFEST did not declare 'lib/auto/POSIX/fputc.al'
> MANIFEST did not declare 'lib/auto/POSIX/fputs.al'
> MANIFEST did not declare 'lib/auto/POSIX/fread.al'
> MANIFEST did not declare 'lib/auto/POSIX/free.al'
> MANIFEST did not declare 'lib/auto/POSIX/freopen.al'
> MANIFEST did not declare 'lib/auto/POSIX/fscanf.al'
> MANIFEST did not declare 'lib/auto/POSIX/fseek.al'
> MANIFEST did not declare 'lib/auto/POSIX/fsetpos.al'
> MANIFEST did not declare 'lib/auto/POSIX/fstat.al'
> MANIFEST did not declare 'lib/auto/POSIX/fsync.al'
> MANIFEST did not declare 'lib/auto/POSIX/ftell.al'
> MANIFEST did not declare 'lib/auto/POSIX/fwrite.al'
> MANIFEST did not declare 'lib/auto/POSIX/getc.al'
> MANIFEST did not declare 'lib/auto/POSIX/getchar.al'
> MANIFEST did not declare 'lib/auto/POSIX/getegid.al'
> MANIFEST did not declare 'lib/auto/POSIX/getenv.al'
> MANIFEST did not declare 'lib/auto/POSIX/geteuid.al'
> MANIFEST did not declare 'lib/auto/POSIX/getgid.al'
> MANIFEST did not declare 'lib/auto/POSIX/getgrgid.al'
> MANIFEST did not declare 'lib/auto/POSIX/getgrnam.al'
> MANIFEST did not declare 'lib/auto/POSIX/getgroups.al'
> MANIFEST did not declare 'lib/auto/POSIX/getlogin.al'
> MANIFEST did not declare 'lib/auto/POSIX/getpgrp.al'
> MANIFEST did not declare 'lib/auto/POSIX/getpid.al'
> MANIFEST did not declare 'lib/auto/POSIX/getppid.al'
> MANIFEST did not declare 'lib/auto/POSIX/getpwnam.al'
> MANIFEST did not declare 'lib/auto/POSIX/getpwuid.al'
> MANIFEST did not declare 'lib/auto/POSIX/gets.al'
> MANIFEST did not declare 'lib/auto/POSIX/getuid.al'
> MANIFEST did not declare 'lib/auto/POSIX/gmtime.al'
> MANIFEST did not declare 'lib/auto/POSIX/isatty.al'
> MANIFEST did not declare 'lib/auto/POSIX/kill.al'
> MANIFEST did not declare 'lib/auto/POSIX/labs.al'
> MANIFEST did not declare 'lib/auto/POSIX/ldiv.al'
> MANIFEST did not declare 'lib/auto/POSIX/link.al'
> MANIFEST did not declare 'lib/auto/POSIX/load_imports.al'
> MANIFEST did not declare 'lib/auto/POSIX/localtime.al'
> MANIFEST did not declare 'lib/auto/POSIX/log.al'
> MANIFEST did not declare 'lib/auto/POSIX/longjmp.al'
> MANIFEST did not declare 'lib/auto/POSIX/malloc.al'
> MANIFEST did not declare 'lib/auto/POSIX/memchr.al'
> MANIFEST did not declare 'lib/auto/POSIX/memcmp.al'
> MANIFEST did not declare 'lib/auto/POSIX/memcpy.al'
> MANIFEST did not declare 'lib/auto/POSIX/memmove.al'
> MANIFEST did not declare 'lib/auto/POSIX/memset.al'
> MANIFEST did not declare 'lib/auto/POSIX/mkdir.al'
> MANIFEST did not declare 'lib/auto/POSIX/offsetof.al'
> MANIFEST did not declare 'lib/auto/POSIX/opendir.al'
> MANIFEST did not declare 'lib/auto/POSIX/perror.al'
> MANIFEST did not declare 'lib/auto/POSIX/pow.al'
> MANIFEST did not declare 'lib/auto/POSIX/printf.al'
> MANIFEST did not declare 'lib/auto/POSIX/putc.al'
> MANIFEST did not declare 'lib/auto/POSIX/putchar.al'
> MANIFEST did not declare 'lib/auto/POSIX/puts.al'
> MANIFEST did not declare 'lib/auto/POSIX/qsort.al'
> MANIFEST did not declare 'lib/auto/POSIX/raise.al'
> MANIFEST did not declare 'lib/auto/POSIX/rand.al'
> MANIFEST did not declare 'lib/auto/POSIX/readdir.al'
> MANIFEST did not declare 'lib/auto/POSIX/realloc.al'
> MANIFEST did not declare 'lib/auto/POSIX/redef.al'
> MANIFEST did not declare 'lib/auto/POSIX/remove.al'
> MANIFEST did not declare 'lib/auto/POSIX/rename.al'
> MANIFEST did not declare 'lib/auto/POSIX/rewind.al'
> MANIFEST did not declare 'lib/auto/POSIX/rewinddir.al'
> MANIFEST did not declare 'lib/auto/POSIX/rmdir.al'
> MANIFEST did not declare 'lib/auto/POSIX/scanf.al'
> MANIFEST did not declare 'lib/auto/POSIX/setbuf.al'
> MANIFEST did not declare 'lib/auto/POSIX/setjmp.al'
> MANIFEST did not declare 'lib/auto/POSIX/setvbuf.al'
> MANIFEST did not declare 'lib/auto/POSIX/siglongjmp.al'
> MANIFEST did not declare 'lib/auto/POSIX/sigsetjmp.al'
> MANIFEST did not declare 'lib/auto/POSIX/sin.al'
> MANIFEST did not declare 'lib/auto/POSIX/sleep.al'
> MANIFEST did not declare 'lib/auto/POSIX/sprintf.al'
> MANIFEST did not declare 'lib/auto/POSIX/sqrt.al'
> MANIFEST did not declare 'lib/auto/POSIX/srand.al'
> MANIFEST did not declare 'lib/auto/POSIX/sscanf.al'
> MANIFEST did not declare 'lib/auto/POSIX/stat.al'
> MANIFEST did not declare 'lib/auto/POSIX/strcat.al'
> MANIFEST did not declare 'lib/auto/POSIX/strchr.al'
> MANIFEST did not declare 'lib/auto/POSIX/strcmp.al'
> MANIFEST did not declare 'lib/auto/POSIX/strcpy.al'
> MANIFEST did not declare 'lib/auto/POSIX/strcspn.al'
> MANIFEST did not declare 'lib/auto/POSIX/strerror.al'
> MANIFEST did not declare 'lib/auto/POSIX/strlen.al'
> MANIFEST did not declare 'lib/auto/POSIX/strncat.al'
> MANIFEST did not declare 'lib/auto/POSIX/strncmp.al'
> MANIFEST did not declare 'lib/auto/POSIX/strncpy.al'
> MANIFEST did not declare 'lib/auto/POSIX/strpbrk.al'
> MANIFEST did not declare 'lib/auto/POSIX/strrchr.al'
> MANIFEST did not declare 'lib/auto/POSIX/strspn.al'
> MANIFEST did not declare 'lib/auto/POSIX/strstr.al'
> MANIFEST did not declare 'lib/auto/POSIX/strtok.al'
> MANIFEST did not declare 'lib/auto/POSIX/system.al'
> MANIFEST did not declare 'lib/auto/POSIX/time.al'
> MANIFEST did not declare 'lib/auto/POSIX/tmpfile.al'
> MANIFEST did not declare 'lib/auto/POSIX/tolower.al'
> MANIFEST did not declare 'lib/auto/POSIX/toupper.al'
> MANIFEST did not declare 'lib/auto/POSIX/umask.al'
> MANIFEST did not declare 'lib/auto/POSIX/ungetc.al'
> MANIFEST did not declare 'lib/auto/POSIX/unimpl.al'
> MANIFEST did not declare 'lib/auto/POSIX/unlink.al'
> MANIFEST did not declare 'lib/auto/POSIX/usage.al'
> MANIFEST did not declare 'lib/auto/POSIX/utime.al'
> MANIFEST did not declare 'lib/auto/POSIX/vfprintf.al'
> MANIFEST did not declare 'lib/auto/POSIX/vprintf.al'
> MANIFEST did not declare 'lib/auto/POSIX/vsprintf.al'
> MANIFEST did not declare 'lib/auto/POSIX/wait.al'
> MANIFEST did not declare 'lib/auto/POSIX/waitpid.al'
> MANIFEST did not declare 'lib/auto/PerlIO/encoding/.exists'
> MANIFEST did not declare 'lib/auto/PerlIO/encoding/encoding.bs'
> MANIFEST did not declare 'lib/auto/PerlIO/encoding/encoding.so'
> MANIFEST did not declare 'lib/auto/PerlIO/scalar/.exists'
> MANIFEST did not declare 'lib/auto/PerlIO/scalar/scalar.bs'
> MANIFEST did not declare 'lib/auto/PerlIO/scalar/scalar.so'
> MANIFEST did not declare 'lib/auto/PerlIO/via/.exists'
> MANIFEST did not declare 'lib/auto/PerlIO/via/via.bs'
> MANIFEST did not declare 'lib/auto/PerlIO/via/via.so'
> MANIFEST did not declare 'lib/auto/SDBM_File/.exists'
> MANIFEST did not declare 'lib/auto/SDBM_File/SDBM_File.bs'
> MANIFEST did not declare 'lib/auto/SDBM_File/SDBM_File.so'
> MANIFEST did not declare 'lib/auto/Socket/.exists'
> MANIFEST did not declare 'lib/auto/Socket/Socket.bs'
> MANIFEST did not declare 'lib/auto/Socket/Socket.so'
> MANIFEST did not declare 'lib/auto/Storable/.exists'
> MANIFEST did not declare 'lib/auto/Storable/BIN_VERSION_NV.al'
> MANIFEST did not declare 'lib/auto/Storable/BIN_WRITE_VERSION_NV.al'
> MANIFEST did not declare 'lib/auto/Storable/CAN_FLOCK.al'
> MANIFEST did not declare 'lib/auto/Storable/Storable.bs'
> MANIFEST did not declare 'lib/auto/Storable/Storable.so'
> MANIFEST did not declare 'lib/auto/Storable/_freeze.al'
> MANIFEST did not declare 'lib/auto/Storable/_retrieve.al'
> MANIFEST did not declare 'lib/auto/Storable/_store.al'
> MANIFEST did not declare 'lib/auto/Storable/_store_fd.al'
> MANIFEST did not declare 'lib/auto/Storable/autosplit.ix'
> MANIFEST did not declare 'lib/auto/Storable/fd_retrieve.al'
> MANIFEST did not declare 'lib/auto/Storable/file_magic.al'
> MANIFEST did not declare 'lib/auto/Storable/freeze.al'
> MANIFEST did not declare 'lib/auto/Storable/lock_nstore.al'
> MANIFEST did not declare 'lib/auto/Storable/lock_retrieve.al'
> MANIFEST did not declare 'lib/auto/Storable/lock_store.al'
> MANIFEST did not declare 'lib/auto/Storable/logcarp.al'
> MANIFEST did not declare 'lib/auto/Storable/logcroak.al'
> MANIFEST did not declare 'lib/auto/Storable/nfreeze.al'
> MANIFEST did not declare 'lib/auto/Storable/nstore.al'
> MANIFEST did not declare 'lib/auto/Storable/nstore_fd.al'
> MANIFEST did not declare 'lib/auto/Storable/read_magic.al'
> MANIFEST did not declare 'lib/auto/Storable/retrieve.al'
> MANIFEST did not declare 'lib/auto/Storable/show_file_magic.al'
> MANIFEST did not declare 'lib/auto/Storable/store.al'
> MANIFEST did not declare 'lib/auto/Storable/store_fd.al'
> MANIFEST did not declare 'lib/auto/Storable/thaw.al'
> MANIFEST did not declare 'lib/auto/Sys/Hostname/.exists'
> MANIFEST did not declare 'lib/auto/Sys/Hostname/Hostname.bs'
> MANIFEST did not declare 'lib/auto/Sys/Hostname/Hostname.so'
> MANIFEST did not declare 'lib/auto/Sys/Hostname/autosplit.ix'
> MANIFEST did not declare 'lib/auto/Sys/Syslog/.exists'
> MANIFEST did not declare 'lib/auto/Sys/Syslog/Syslog.bs'
> MANIFEST did not declare 'lib/auto/Sys/Syslog/Syslog.so'
> MANIFEST did not declare 'lib/auto/Text/Soundex/.exists'
> MANIFEST did not declare 'lib/auto/Text/Soundex/Soundex.bs'
> MANIFEST did not declare 'lib/auto/Text/Soundex/Soundex.so'
> MANIFEST did not declare 'lib/auto/Time/HiRes/.exists'
> MANIFEST did not declare 'lib/auto/Time/HiRes/HiRes.bs'
> MANIFEST did not declare 'lib/auto/Time/HiRes/HiRes.so'
> MANIFEST did not declare 'lib/auto/Time/Piece/.exists'
> MANIFEST did not declare 'lib/auto/Time/Piece/Piece.bs'
> MANIFEST did not declare 'lib/auto/Time/Piece/Piece.so'
> MANIFEST did not declare 'lib/auto/Unicode/Normalize/.exists'
> MANIFEST did not declare 'lib/auto/Unicode/Normalize/Normalize.bs'
> MANIFEST did not declare 'lib/auto/Unicode/Normalize/Normalize.so'
> MANIFEST did not declare 'lib/auto/XS/APItest/.exists'
> MANIFEST did not declare 'lib/auto/XS/APItest/APItest.bs'
> MANIFEST did not declare 'lib/auto/XS/APItest/APItest.so'
> MANIFEST did not declare 'lib/auto/XS/Typemap/.exists'
> MANIFEST did not declare 'lib/auto/XS/Typemap/Typemap.bs'
> MANIFEST did not declare 'lib/auto/XS/Typemap/Typemap.so'
> MANIFEST did not declare 'lib/auto/attrs/.exists'
> MANIFEST did not declare 'lib/auto/attrs/attrs.bs'
> MANIFEST did not declare 'lib/auto/attrs/attrs.so'
> MANIFEST did not declare 'lib/auto/re/.exists'
> MANIFEST did not declare 'lib/auto/re/re.bs'
> MANIFEST did not declare 'lib/auto/re/re.so'
> MANIFEST did not declare 'lib/auto/sdbm/.exists'
> MANIFEST did not declare 'lib/auto/sdbm/extralibs.ld'
> MANIFEST did not declare 'lib/auto/threads/.exists'
> MANIFEST did not declare 'lib/auto/threads/shared/.exists'
> MANIFEST did not declare 'lib/auto/threads/shared/shared.bs'
> MANIFEST did not declare 'lib/auto/threads/shared/shared.so'
> MANIFEST did not declare 'lib/auto/threads/threads.bs'
> MANIFEST did not declare 'lib/auto/threads/threads.so'
> MANIFEST did not declare 'lib/encoding.pm'
> MANIFEST did not declare 'lib/lib.pm'
> MANIFEST did not declare 'lib/ops.pm'
> MANIFEST did not declare 'lib/re.pm'
> MANIFEST did not declare 'lib/threads.pm'
> MANIFEST did not declare 'lib/threads/.exists'
> MANIFEST did not declare 'lib/threads/shared.pm'
> MANIFEST did not declare 'lib/unicore/Canonical.pl'
> MANIFEST did not declare 'lib/unicore/CombiningClass.pl'
> MANIFEST did not declare 'lib/unicore/Decomposition.pl'
> MANIFEST did not declare 'lib/unicore/Exact.pl'
> MANIFEST did not declare 'lib/unicore/Name.pl'
> MANIFEST did not declare 'lib/unicore/PVA.pl'
> MANIFEST did not declare 'lib/unicore/Properties'
> MANIFEST did not declare 'lib/unicore/To/Digit.pl'
> MANIFEST did not declare 'lib/unicore/To/Fold.pl'
> MANIFEST did not declare 'lib/unicore/To/Lower.pl'
> MANIFEST did not declare 'lib/unicore/To/Title.pl'
> MANIFEST did not declare 'lib/unicore/To/Upper.pl'
> MANIFEST did not declare 'lib/unicore/lib/bc/AL.pl'
> MANIFEST did not declare 'lib/unicore/lib/bc/AN.pl'
> MANIFEST did not declare 'lib/unicore/lib/bc/B.pl'
> MANIFEST did not declare 'lib/unicore/lib/bc/BN.pl'
> MANIFEST did not declare 'lib/unicore/lib/bc/CS.pl'
> MANIFEST did not declare 'lib/unicore/lib/bc/EN.pl'
> MANIFEST did not declare 'lib/unicore/lib/bc/ES.pl'
> MANIFEST did not declare 'lib/unicore/lib/bc/ET.pl'
> MANIFEST did not declare 'lib/unicore/lib/bc/L.pl'
> MANIFEST did not declare 'lib/unicore/lib/bc/LRE.pl'
> MANIFEST did not declare 'lib/unicore/lib/bc/LRO.pl'
> MANIFEST did not declare 'lib/unicore/lib/bc/NSM.pl'
> MANIFEST did not declare 'lib/unicore/lib/bc/ON.pl'
> MANIFEST did not declare 'lib/unicore/lib/bc/PDF.pl'
> MANIFEST did not declare 'lib/unicore/lib/bc/R.pl'
> MANIFEST did not declare 'lib/unicore/lib/bc/RLE.pl'
> MANIFEST did not declare 'lib/unicore/lib/bc/RLO.pl'
> MANIFEST did not declare 'lib/unicore/lib/bc/S.pl'
> MANIFEST did not declare 'lib/unicore/lib/bc/WS.pl'
> MANIFEST did not declare 'lib/unicore/lib/ccc/A.pl'
> MANIFEST did not declare 'lib/unicore/lib/ccc/AL.pl'
> MANIFEST did not declare 'lib/unicore/lib/ccc/AR.pl'
> MANIFEST did not declare 'lib/unicore/lib/ccc/ATAR.pl'
> MANIFEST did not declare 'lib/unicore/lib/ccc/ATB.pl'
> MANIFEST did not declare 'lib/unicore/lib/ccc/ATBL.pl'
> MANIFEST did not declare 'lib/unicore/lib/ccc/B.pl'
> MANIFEST did not declare 'lib/unicore/lib/ccc/BL.pl'
> MANIFEST did not declare 'lib/unicore/lib/ccc/BR.pl'
> MANIFEST did not declare 'lib/unicore/lib/ccc/DA.pl'
> MANIFEST did not declare 'lib/unicore/lib/ccc/DB.pl'
> MANIFEST did not declare 'lib/unicore/lib/ccc/IS.pl'
> MANIFEST did not declare 'lib/unicore/lib/ccc/KV.pl'
> MANIFEST did not declare 'lib/unicore/lib/ccc/L.pl'
> MANIFEST did not declare 'lib/unicore/lib/ccc/NK.pl'
> MANIFEST did not declare 'lib/unicore/lib/ccc/NR.pl'
> MANIFEST did not declare 'lib/unicore/lib/ccc/OV.pl'
> MANIFEST did not declare 'lib/unicore/lib/ccc/R.pl'
> MANIFEST did not declare 'lib/unicore/lib/ccc/VR.pl'
> MANIFEST did not declare 'lib/unicore/lib/dt/can.pl'
> MANIFEST did not declare 'lib/unicore/lib/dt/com.pl'
> MANIFEST did not declare 'lib/unicore/lib/dt/enc.pl'
> MANIFEST did not declare 'lib/unicore/lib/dt/fin.pl'
> MANIFEST did not declare 'lib/unicore/lib/dt/font.pl'
> MANIFEST did not declare 'lib/unicore/lib/dt/fra.pl'
> MANIFEST did not declare 'lib/unicore/lib/dt/init.pl'
> MANIFEST did not declare 'lib/unicore/lib/dt/iso.pl'
> MANIFEST did not declare 'lib/unicore/lib/dt/med.pl'
> MANIFEST did not declare 'lib/unicore/lib/dt/nar.pl'
> MANIFEST did not declare 'lib/unicore/lib/dt/nb.pl'
> MANIFEST did not declare 'lib/unicore/lib/dt/sml.pl'
> MANIFEST did not declare 'lib/unicore/lib/dt/sqr.pl'
> MANIFEST did not declare 'lib/unicore/lib/dt/sub.pl'
> MANIFEST did not declare 'lib/unicore/lib/dt/sup.pl'
> MANIFEST did not declare 'lib/unicore/lib/dt/vert.pl'
> MANIFEST did not declare 'lib/unicore/lib/dt/wide.pl'
> MANIFEST did not declare 'lib/unicore/lib/ea/A.pl'
> MANIFEST did not declare 'lib/unicore/lib/ea/F.pl'
> MANIFEST did not declare 'lib/unicore/lib/ea/H.pl'
> MANIFEST did not declare 'lib/unicore/lib/ea/N.pl'
> MANIFEST did not declare 'lib/unicore/lib/ea/Na.pl'
> MANIFEST did not declare 'lib/unicore/lib/ea/W.pl'
> MANIFEST did not declare 'lib/unicore/lib/gc_sc/AHex.pl'
> MANIFEST did not declare 'lib/unicore/lib/gc_sc/ASCII.pl'
> MANIFEST did not declare 'lib/unicore/lib/gc_sc/Alnum.pl'
> MANIFEST did not declare 'lib/unicore/lib/gc_sc/Alpha.pl'
> MANIFEST did not declare 'lib/unicore/lib/gc_sc/Alphabet.pl'
> MANIFEST did not declare 'lib/unicore/lib/gc_sc/Any.pl'
> MANIFEST did not declare 'lib/unicore/lib/gc_sc/Arab.pl'
> MANIFEST did not declare 'lib/unicore/lib/gc_sc/Armn.pl'
> MANIFEST did not declare 'lib/unicore/lib/gc_sc/AsciiHex.pl'
> MANIFEST did not declare 'lib/unicore/lib/gc_sc/Assigned.pl'
> MANIFEST did not declare 'lib/unicore/lib/gc_sc/Bali.pl'
> MANIFEST did not declare 'lib/unicore/lib/gc_sc/Beng.pl'
> MANIFEST did not declare 'lib/unicore/lib/gc_sc/BidiC.pl'
> MANIFEST did not declare 'lib/unicore/lib/gc_sc/BidiCont.pl'
> MANIFEST did not declare 'lib/unicore/lib/gc_sc/Blank.pl'
> MANIFEST did not declare 'lib/unicore/lib/gc_sc/Bopo.pl'
> MANIFEST did not declare 'lib/unicore/lib/gc_sc/Brai.pl'
> MANIFEST did not declare 'lib/unicore/lib/gc_sc/Bugi.pl'
> MANIFEST did not declare 'lib/unicore/lib/gc_sc/Buhd.pl'
> MANIFEST did not declare 'lib/unicore/lib/gc_sc/C.pl'
> MANIFEST did not declare 'lib/unicore/lib/gc_sc/Canadian.pl'
> MANIFEST did not declare 'lib/unicore/lib/gc_sc/Cc.pl'
> MANIFEST did not declare 'lib/unicore/lib/gc_sc/Cf.pl'
> MANIFEST did not declare 'lib/unicore/lib/gc_sc/Cher.pl'
> MANIFEST did not declare 'lib/unicore/lib/gc_sc/Cn.pl'
> MANIFEST did not declare 'lib/unicore/lib/gc_sc/Cntrl.pl'
> MANIFEST did not declare 'lib/unicore/lib/gc_sc/Co.pl'
> MANIFEST did not declare 'lib/unicore/lib/gc_sc/Copt.pl'
> MANIFEST did not declare 'lib/unicore/lib/gc_sc/Cprt.pl'
> MANIFEST did not declare 'lib/unicore/lib/gc_sc/Cs.pl'
> MANIFEST did not declare 'lib/unicore/lib/gc_sc/Cyrl.pl'
> MANIFEST did not declare 'lib/unicore/lib/gc_sc/Dash.pl'
> MANIFEST did not declare 'lib/unicore/lib/gc_sc/Dash2.pl'
> MANIFEST did not declare 'lib/unicore/lib/gc_sc/DefaultI.pl'
> MANIFEST did not declare 'lib/unicore/lib/gc_sc/Dep.pl'
> MANIFEST did not declare 'lib/unicore/lib/gc_sc/Deprecat.pl'
> MANIFEST did not declare 'lib/unicore/lib/gc_sc/Deva.pl'
> MANIFEST did not declare 'lib/unicore/lib/gc_sc/Dia.pl'
> MANIFEST did not declare 'lib/unicore/lib/gc_sc/Diacriti.pl'
> MANIFEST did not declare 'lib/unicore/lib/gc_sc/Digit.pl'
> MANIFEST did not declare 'lib/unicore/lib/gc_sc/Dsrt.pl'
> MANIFEST did not declare 'lib/unicore/lib/gc_sc/Ethi.pl'
> MANIFEST did not declare 'lib/unicore/lib/gc_sc/Ext.pl'
> MANIFEST did not declare 'lib/unicore/lib/gc_sc/Extender.pl'
> MANIFEST did not declare 'lib/unicore/lib/gc_sc/Geor.pl'
> MANIFEST did not declare 'lib/unicore/lib/gc_sc/Glag.pl'
> MANIFEST did not declare 'lib/unicore/lib/gc_sc/Goth.pl'
> MANIFEST did not declare 'lib/unicore/lib/gc_sc/Graph.pl'
> MANIFEST did not declare 'lib/unicore/lib/gc_sc/Grek.pl'
> MANIFEST did not declare 'lib/unicore/lib/gc_sc/Gujr.pl'
> MANIFEST did not declare 'lib/unicore/lib/gc_sc/Guru.pl'
> MANIFEST did not declare 'lib/unicore/lib/gc_sc/Hang.pl'
> MANIFEST did not declare 'lib/unicore/lib/gc_sc/Hani.pl'
> MANIFEST did not declare 'lib/unicore/lib/gc_sc/Hano.pl'
> MANIFEST did not declare 'lib/unicore/lib/gc_sc/Hebr.pl'
> MANIFEST did not declare 'lib/unicore/lib/gc_sc/Hex.pl'
> MANIFEST did not declare 'lib/unicore/lib/gc_sc/HexDigit.pl'
> MANIFEST did not declare 'lib/unicore/lib/gc_sc/Hira.pl'
> MANIFEST did not declare 'lib/unicore/lib/gc_sc/HorizSpa.pl'
> MANIFEST did not declare 'lib/unicore/lib/gc_sc/Hyphen.pl'
> MANIFEST did not declare 'lib/unicore/lib/gc_sc/Hyphen2.pl'
> MANIFEST did not declare 'lib/unicore/lib/gc_sc/IDSB.pl'
> MANIFEST did not declare 'lib/unicore/lib/gc_sc/IDST.pl'
> MANIFEST did not declare 'lib/unicore/lib/gc_sc/IdContin.pl'
> MANIFEST did not declare 'lib/unicore/lib/gc_sc/IdStart.pl'
> MANIFEST did not declare 'lib/unicore/lib/gc_sc/Ideo.pl'
> MANIFEST did not declare 'lib/unicore/lib/gc_sc/Ideograp.pl'
> MANIFEST did not declare 'lib/unicore/lib/gc_sc/IdsBinar.pl'
> MANIFEST did not declare 'lib/unicore/lib/gc_sc/IdsTrina.pl'
> MANIFEST did not declare 'lib/unicore/lib/gc_sc/InAegean.pl'
> MANIFEST did not declare 'lib/unicore/lib/gc_sc/InAlphab.pl'
> MANIFEST did not declare 'lib/unicore/lib/gc_sc/InAncie2.pl'
> MANIFEST did not declare 'lib/unicore/lib/gc_sc/InAncien.pl'
> MANIFEST did not declare 'lib/unicore/lib/gc_sc/InArabi2.pl'
> MANIFEST did not declare 'lib/unicore/lib/gc_sc/InArabi3.pl'
> MANIFEST did not declare 'lib/unicore/lib/gc_sc/InArabi4.pl'
> MANIFEST did not declare 'lib/unicore/lib/gc_sc/InArabic.pl'
> MANIFEST did not declare 'lib/unicore/lib/gc_sc/InArmeni.pl'
> MANIFEST did not declare 'lib/unicore/lib/gc_sc/InArrows.pl'
> MANIFEST did not declare 'lib/unicore/lib/gc_sc/InBaline.pl'
> MANIFEST did not declare 'lib/unicore/lib/gc_sc/InBasicL.pl'
> MANIFEST did not declare 'lib/unicore/lib/gc_sc/InBengal.pl'
> MANIFEST did not declare 'lib/unicore/lib/gc_sc/InBlockE.pl'
> MANIFEST did not declare 'lib/unicore/lib/gc_sc/InBopom2.pl'
> MANIFEST did not declare 'lib/unicore/lib/gc_sc/InBopomo.pl'
> MANIFEST did not declare 'lib/unicore/lib/gc_sc/InBoxDra.pl'
> MANIFEST did not declare 'lib/unicore/lib/gc_sc/InBraill.pl'
> MANIFEST did not declare 'lib/unicore/lib/gc_sc/InBugine.pl'
> MANIFEST did not declare 'lib/unicore/lib/gc_sc/InBuhid.pl'
> MANIFEST did not declare 'lib/unicore/lib/gc_sc/InByzant.pl'
> MANIFEST did not declare 'lib/unicore/lib/gc_sc/InCherok.pl'
> MANIFEST did not declare 'lib/unicore/lib/gc_sc/InCjkCo2.pl'
> MANIFEST did not declare 'lib/unicore/lib/gc_sc/InCjkCo3.pl'
> MANIFEST did not declare 'lib/unicore/lib/gc_sc/InCjkCo4.pl'
> MANIFEST did not declare 'lib/unicore/lib/gc_sc/InCjkCom.pl'
> MANIFEST did not declare 'lib/unicore/lib/gc_sc/InCjkRad.pl'
> MANIFEST did not declare 'lib/unicore/lib/gc_sc/InCjkStr.pl'
> MANIFEST did not declare 'lib/unicore/lib/gc_sc/InCjkSym.pl'
> MANIFEST did not declare 'lib/unicore/lib/gc_sc/InCjkUn2.pl'
> MANIFEST did not declare 'lib/unicore/lib/gc_sc/InCjkUn3.pl'
> MANIFEST did not declare 'lib/unicore/lib/gc_sc/InCjkUni.pl'
> MANIFEST did not declare 'lib/unicore/lib/gc_sc/InCombi2.pl'
> MANIFEST did not declare 'lib/unicore/lib/gc_sc/InCombi3.pl'
> MANIFEST did not declare 'lib/unicore/lib/gc_sc/InCombi4.pl'
> MANIFEST did not declare 'lib/unicore/lib/gc_sc/InCombin.pl'
> MANIFEST did not declare 'lib/unicore/lib/gc_sc/InContro.pl'
> MANIFEST did not declare 'lib/unicore/lib/gc_sc/InCoptic.pl'
> MANIFEST did not declare 'lib/unicore/lib/gc_sc/InCounti.pl'
> MANIFEST did not declare 'lib/unicore/lib/gc_sc/InCunei2.pl'
> MANIFEST did not declare 'lib/unicore/lib/gc_sc/InCuneif.pl'
> MANIFEST did not declare 'lib/unicore/lib/gc_sc/InCurren.pl'
> MANIFEST did not declare 'lib/unicore/lib/gc_sc/InCyprio.pl'
> MANIFEST did not declare 'lib/unicore/lib/gc_sc/InCyril2.pl'
> MANIFEST did not declare 'lib/unicore/lib/gc_sc/InCyrill.pl'
> MANIFEST did not declare 'lib/unicore/lib/gc_sc/InDesere.pl'
> MANIFEST did not declare 'lib/unicore/lib/gc_sc/InDevana.pl'
> MANIFEST did not declare 'lib/unicore/lib/gc_sc/InDingba.pl'
> MANIFEST did not declare 'lib/unicore/lib/gc_sc/InEnclo2.pl'
> MANIFEST did not declare 'lib/unicore/lib/gc_sc/InEnclos.pl'
> MANIFEST did not declare 'lib/unicore/lib/gc_sc/InEthio2.pl'
> MANIFEST did not declare 'lib/unicore/lib/gc_sc/InEthio3.pl'
> MANIFEST did not declare 'lib/unicore/lib/gc_sc/InEthiop.pl'
> MANIFEST did not declare 'lib/unicore/lib/gc_sc/InGenera.pl'
> MANIFEST did not declare 'lib/unicore/lib/gc_sc/InGeomet.pl'
> MANIFEST did not declare 'lib/unicore/lib/gc_sc/InGeorg2.pl'
> MANIFEST did not declare 'lib/unicore/lib/gc_sc/InGeorgi.pl'
> MANIFEST did not declare 'lib/unicore/lib/gc_sc/InGlagol.pl'
> MANIFEST did not declare 'lib/unicore/lib/gc_sc/InGothic.pl'
> MANIFEST did not declare 'lib/unicore/lib/gc_sc/InGreekA.pl'
> MANIFEST did not declare 'lib/unicore/lib/gc_sc/InGreekE.pl'
> MANIFEST did not declare 'lib/unicore/lib/gc_sc/InGujara.pl'
> MANIFEST did not declare 'lib/unicore/lib/gc_sc/InGurmuk.pl'
> MANIFEST did not declare 'lib/unicore/lib/gc_sc/InHalfwi.pl'
> MANIFEST did not declare 'lib/unicore/lib/gc_sc/InHangu2.pl'
> MANIFEST did not declare 'lib/unicore/lib/gc_sc/InHangu3.pl'
> MANIFEST did not declare 'lib/unicore/lib/gc_sc/InHangul.pl'
> MANIFEST did not declare 'lib/unicore/lib/gc_sc/InHanuno.pl'
> MANIFEST did not declare 'lib/unicore/lib/gc_sc/InHebrew.pl'
> MANIFEST did not declare 'lib/unicore/lib/gc_sc/InHighPr.pl'
> MANIFEST did not declare 'lib/unicore/lib/gc_sc/InHighSu.pl'
> MANIFEST did not declare 'lib/unicore/lib/gc_sc/InHiraga.pl'
> MANIFEST did not declare 'lib/unicore/lib/gc_sc/InIdeogr.pl'
> MANIFEST did not declare 'lib/unicore/lib/gc_sc/InIpaExt.pl'
> MANIFEST did not declare 'lib/unicore/lib/gc_sc/InKanbun.pl'
> MANIFEST did not declare 'lib/unicore/lib/gc_sc/InKangxi.pl'
> MANIFEST did not declare 'lib/unicore/lib/gc_sc/InKannad.pl'
> MANIFEST did not declare 'lib/unicore/lib/gc_sc/InKatak2.pl'
> MANIFEST did not declare 'lib/unicore/lib/gc_sc/InKataka.pl'
> MANIFEST did not declare 'lib/unicore/lib/gc_sc/InKharos.pl'
> MANIFEST did not declare 'lib/unicore/lib/gc_sc/InKhmer.pl'
> MANIFEST did not declare 'lib/unicore/lib/gc_sc/InKhmerS.pl'
> MANIFEST did not declare 'lib/unicore/lib/gc_sc/InLao.pl'
> MANIFEST did not declare 'lib/unicore/lib/gc_sc/InLatin1.pl'
> MANIFEST did not declare 'lib/unicore/lib/gc_sc/InLatin2.pl'
> MANIFEST did not declare 'lib/unicore/lib/gc_sc/InLatin3.pl'
> MANIFEST did not declare 'lib/unicore/lib/gc_sc/InLatin4.pl'
> MANIFEST did not declare 'lib/unicore/lib/gc_sc/InLatin5.pl'
> MANIFEST did not declare 'lib/unicore/lib/gc_sc/InLatinE.pl'
> MANIFEST did not declare 'lib/unicore/lib/gc_sc/InLetter.pl'
> MANIFEST did not declare 'lib/unicore/lib/gc_sc/InLimbu.pl'
> MANIFEST did not declare 'lib/unicore/lib/gc_sc/InLinea2.pl'
> MANIFEST did not declare 'lib/unicore/lib/gc_sc/InLinear.pl'
> MANIFEST did not declare 'lib/unicore/lib/gc_sc/InLowSur.pl'
> MANIFEST did not declare 'lib/unicore/lib/gc_sc/InMalaya.pl'
> MANIFEST did not declare 'lib/unicore/lib/gc_sc/InMathe2.pl'
> MANIFEST did not declare 'lib/unicore/lib/gc_sc/InMathem.pl'
> MANIFEST did not declare 'lib/unicore/lib/gc_sc/InMisce2.pl'
> MANIFEST did not declare 'lib/unicore/lib/gc_sc/InMisce3.pl'
> MANIFEST did not declare 'lib/unicore/lib/gc_sc/InMisce4.pl'
> MANIFEST did not declare 'lib/unicore/lib/gc_sc/InMisce5.pl'
> MANIFEST did not declare 'lib/unicore/lib/gc_sc/InMiscel.pl'
> MANIFEST did not declare 'lib/unicore/lib/gc_sc/InModifi.pl'
> MANIFEST did not declare 'lib/unicore/lib/gc_sc/InMongol.pl'
> MANIFEST did not declare 'lib/unicore/lib/gc_sc/InMusica.pl'
> MANIFEST did not declare 'lib/unicore/lib/gc_sc/InMyanma.pl'
> MANIFEST did not declare 'lib/unicore/lib/gc_sc/InNewTai.pl'
> MANIFEST did not declare 'lib/unicore/lib/gc_sc/InNko.pl'
> MANIFEST did not declare 'lib/unicore/lib/gc_sc/InNumber.pl'
> MANIFEST did not declare 'lib/unicore/lib/gc_sc/InOgham.pl'
> MANIFEST did not declare 'lib/unicore/lib/gc_sc/InOldIta.pl'
> MANIFEST did not declare 'lib/unicore/lib/gc_sc/InOldPer.pl'
> MANIFEST did not declare 'lib/unicore/lib/gc_sc/InOptica.pl'
> MANIFEST did not declare 'lib/unicore/lib/gc_sc/InOriya.pl'
> MANIFEST did not declare 'lib/unicore/lib/gc_sc/InOsmany.pl'
> MANIFEST did not declare 'lib/unicore/lib/gc_sc/InPhagsP.pl'
> MANIFEST did not declare 'lib/unicore/lib/gc_sc/InPhoeni.pl'
> MANIFEST did not declare 'lib/unicore/lib/gc_sc/InPhone2.pl'
> MANIFEST did not declare 'lib/unicore/lib/gc_sc/InPhonet.pl'
> MANIFEST did not declare 'lib/unicore/lib/gc_sc/InPrivat.pl'
> MANIFEST did not declare 'lib/unicore/lib/gc_sc/InRunic.pl'
> MANIFEST did not declare 'lib/unicore/lib/gc_sc/InShavia.pl'
> MANIFEST did not declare 'lib/unicore/lib/gc_sc/InSinhal.pl'
> MANIFEST did not declare 'lib/unicore/lib/gc_sc/InSmallF.pl'
> MANIFEST did not declare 'lib/unicore/lib/gc_sc/InSpacin.pl'
> MANIFEST did not declare 'lib/unicore/lib/gc_sc/InSpecia.pl'
> MANIFEST did not declare 'lib/unicore/lib/gc_sc/InSupers.pl'
> MANIFEST did not declare 'lib/unicore/lib/gc_sc/InSuppl2.pl'
> MANIFEST did not declare 'lib/unicore/lib/gc_sc/InSuppl3.pl'
> MANIFEST did not declare 'lib/unicore/lib/gc_sc/InSuppl4.pl'
> MANIFEST did not declare 'lib/unicore/lib/gc_sc/InSuppl5.pl'
> MANIFEST did not declare 'lib/unicore/lib/gc_sc/InSuppl6.pl'
> MANIFEST did not declare 'lib/unicore/lib/gc_sc/InSupple.pl'
> MANIFEST did not declare 'lib/unicore/lib/gc_sc/InSyloti.pl'
> MANIFEST did not declare 'lib/unicore/lib/gc_sc/InSyriac.pl'
> MANIFEST did not declare 'lib/unicore/lib/gc_sc/InTagalo.pl'
> MANIFEST did not declare 'lib/unicore/lib/gc_sc/InTagban.pl'
> MANIFEST did not declare 'lib/unicore/lib/gc_sc/InTags.pl'
> MANIFEST did not declare 'lib/unicore/lib/gc_sc/InTaiLe.pl'
> MANIFEST did not declare 'lib/unicore/lib/gc_sc/InTaiXua.pl'
> MANIFEST did not declare 'lib/unicore/lib/gc_sc/InTamil.pl'
> MANIFEST did not declare 'lib/unicore/lib/gc_sc/InTelugu.pl'
> MANIFEST did not declare 'lib/unicore/lib/gc_sc/InThaana.pl'
> MANIFEST did not declare 'lib/unicore/lib/gc_sc/InThai.pl'
> MANIFEST did not declare 'lib/unicore/lib/gc_sc/InTibeta.pl'
> MANIFEST did not declare 'lib/unicore/lib/gc_sc/InTifina.pl'
> MANIFEST did not declare 'lib/unicore/lib/gc_sc/InUgarit.pl'
> MANIFEST did not declare 'lib/unicore/lib/gc_sc/InUnifie.pl'
> MANIFEST did not declare 'lib/unicore/lib/gc_sc/InVaria2.pl'
> MANIFEST did not declare 'lib/unicore/lib/gc_sc/InVariat.pl'
> MANIFEST did not declare 'lib/unicore/lib/gc_sc/InVertic.pl'
> MANIFEST did not declare 'lib/unicore/lib/gc_sc/InYiRadi.pl'
> MANIFEST did not declare 'lib/unicore/lib/gc_sc/InYiSyll.pl'
> MANIFEST did not declare 'lib/unicore/lib/gc_sc/InYijing.pl'
> MANIFEST did not declare 'lib/unicore/lib/gc_sc/JoinC.pl'
> MANIFEST did not declare 'lib/unicore/lib/gc_sc/JoinCont.pl'
> MANIFEST did not declare 'lib/unicore/lib/gc_sc/Kana.pl'
> MANIFEST did not declare 'lib/unicore/lib/gc_sc/Khar.pl'
> MANIFEST did not declare 'lib/unicore/lib/gc_sc/Khmr.pl'
> MANIFEST did not declare 'lib/unicore/lib/gc_sc/Knda.pl'
> MANIFEST did not declare 'lib/unicore/lib/gc_sc/L.pl'
> MANIFEST did not declare 'lib/unicore/lib/gc_sc/LC.pl'
> MANIFEST did not declare 'lib/unicore/lib/gc_sc/LOE.pl'
> MANIFEST did not declare 'lib/unicore/lib/gc_sc/Laoo.pl'
> MANIFEST did not declare 'lib/unicore/lib/gc_sc/Latn.pl'
> MANIFEST did not declare 'lib/unicore/lib/gc_sc/Limb.pl'
> MANIFEST did not declare 'lib/unicore/lib/gc_sc/LinearB.pl'
> MANIFEST did not declare 'lib/unicore/lib/gc_sc/Ll.pl'
> MANIFEST did not declare 'lib/unicore/lib/gc_sc/Lm.pl'
> MANIFEST did not declare 'lib/unicore/lib/gc_sc/Lo.pl'
> MANIFEST did not declare 'lib/unicore/lib/gc_sc/LogicalO.pl'
> MANIFEST did not declare 'lib/unicore/lib/gc_sc/Lower.pl'
> MANIFEST did not declare 'lib/unicore/lib/gc_sc/Lowercas.pl'
> MANIFEST did not declare 'lib/unicore/lib/gc_sc/Lt.pl'
> MANIFEST did not declare 'lib/unicore/lib/gc_sc/Lu.pl'
> MANIFEST did not declare 'lib/unicore/lib/gc_sc/M.pl'
> MANIFEST did not declare 'lib/unicore/lib/gc_sc/Math.pl'
> MANIFEST did not declare 'lib/unicore/lib/gc_sc/Mc.pl'
> MANIFEST did not declare 'lib/unicore/lib/gc_sc/Me.pl'
> MANIFEST did not declare 'lib/unicore/lib/gc_sc/Mlym.pl'
> MANIFEST did not declare 'lib/unicore/lib/gc_sc/Mn.pl'
> MANIFEST did not declare 'lib/unicore/lib/gc_sc/Mong.pl'
> MANIFEST did not declare 'lib/unicore/lib/gc_sc/Mymr.pl'
> MANIFEST did not declare 'lib/unicore/lib/gc_sc/N.pl'
> MANIFEST did not declare 'lib/unicore/lib/gc_sc/NChar.pl'
> MANIFEST did not declare 'lib/unicore/lib/gc_sc/Nd.pl'
> MANIFEST did not declare 'lib/unicore/lib/gc_sc/NewTaiLu.pl'
> MANIFEST did not declare 'lib/unicore/lib/gc_sc/Nkoo.pl'
> MANIFEST did not declare 'lib/unicore/lib/gc_sc/Nl.pl'
> MANIFEST did not declare 'lib/unicore/lib/gc_sc/No.pl'
> MANIFEST did not declare 'lib/unicore/lib/gc_sc/Nonchara.pl'
> MANIFEST did not declare 'lib/unicore/lib/gc_sc/OAlpha.pl'
> MANIFEST did not declare 'lib/unicore/lib/gc_sc/ODI.pl'
> MANIFEST did not declare 'lib/unicore/lib/gc_sc/OGrExt.pl'
> MANIFEST did not declare 'lib/unicore/lib/gc_sc/OIDC.pl'
> MANIFEST did not declare 'lib/unicore/lib/gc_sc/OIDS.pl'
> MANIFEST did not declare 'lib/unicore/lib/gc_sc/OLower.pl'
> MANIFEST did not declare 'lib/unicore/lib/gc_sc/OMath.pl'
> MANIFEST did not declare 'lib/unicore/lib/gc_sc/OUpper.pl'
> MANIFEST did not declare 'lib/unicore/lib/gc_sc/Ogam.pl'
> MANIFEST did not declare 'lib/unicore/lib/gc_sc/OldItali.pl'
> MANIFEST did not declare 'lib/unicore/lib/gc_sc/OldPersi.pl'
> MANIFEST did not declare 'lib/unicore/lib/gc_sc/Orya.pl'
> MANIFEST did not declare 'lib/unicore/lib/gc_sc/Osma.pl'
> MANIFEST did not declare 'lib/unicore/lib/gc_sc/OtherAlp.pl'
> MANIFEST did not declare 'lib/unicore/lib/gc_sc/OtherDef.pl'
> MANIFEST did not declare 'lib/unicore/lib/gc_sc/OtherGra.pl'
> MANIFEST did not declare 'lib/unicore/lib/gc_sc/OtherIdC.pl'
> MANIFEST did not declare 'lib/unicore/lib/gc_sc/OtherIdS.pl'
> MANIFEST did not declare 'lib/unicore/lib/gc_sc/OtherLow.pl'
> MANIFEST did not declare 'lib/unicore/lib/gc_sc/OtherMat.pl'
> MANIFEST did not declare 'lib/unicore/lib/gc_sc/OtherUpp.pl'
> MANIFEST did not declare 'lib/unicore/lib/gc_sc/P.pl'
> MANIFEST did not declare 'lib/unicore/lib/gc_sc/PatSyn.pl'
> MANIFEST did not declare 'lib/unicore/lib/gc_sc/PatWS.pl'
> MANIFEST did not declare 'lib/unicore/lib/gc_sc/PatternS.pl'
> MANIFEST did not declare 'lib/unicore/lib/gc_sc/PatternW.pl'
> MANIFEST did not declare 'lib/unicore/lib/gc_sc/Pc.pl'
> MANIFEST did not declare 'lib/unicore/lib/gc_sc/Pd.pl'
> MANIFEST did not declare 'lib/unicore/lib/gc_sc/Pe.pl'
> MANIFEST did not declare 'lib/unicore/lib/gc_sc/Pf.pl'
> MANIFEST did not declare 'lib/unicore/lib/gc_sc/PhagsPa.pl'
> MANIFEST did not declare 'lib/unicore/lib/gc_sc/Phnx.pl'
> MANIFEST did not declare 'lib/unicore/lib/gc_sc/Pi.pl'
> MANIFEST did not declare 'lib/unicore/lib/gc_sc/Po.pl'
> MANIFEST did not declare 'lib/unicore/lib/gc_sc/Print.pl'
> MANIFEST did not declare 'lib/unicore/lib/gc_sc/Ps.pl'
> MANIFEST did not declare 'lib/unicore/lib/gc_sc/Punct.pl'
> MANIFEST did not declare 'lib/unicore/lib/gc_sc/QMark.pl'
> MANIFEST did not declare 'lib/unicore/lib/gc_sc/Qaai.pl'
> MANIFEST did not declare 'lib/unicore/lib/gc_sc/Quotatio.pl'
> MANIFEST did not declare 'lib/unicore/lib/gc_sc/Radical.pl'
> MANIFEST did not declare 'lib/unicore/lib/gc_sc/Radical2.pl'
> MANIFEST did not declare 'lib/unicore/lib/gc_sc/Runr.pl'
> MANIFEST did not declare 'lib/unicore/lib/gc_sc/S.pl'
> MANIFEST did not declare 'lib/unicore/lib/gc_sc/SD.pl'
> MANIFEST did not declare 'lib/unicore/lib/gc_sc/STerm.pl'
> MANIFEST did not declare 'lib/unicore/lib/gc_sc/Sc.pl'
> MANIFEST did not declare 'lib/unicore/lib/gc_sc/Shaw.pl'
> MANIFEST did not declare 'lib/unicore/lib/gc_sc/Sinh.pl'
> MANIFEST did not declare 'lib/unicore/lib/gc_sc/Sk.pl'
> MANIFEST did not declare 'lib/unicore/lib/gc_sc/Sm.pl'
> MANIFEST did not declare 'lib/unicore/lib/gc_sc/So.pl'
> MANIFEST did not declare 'lib/unicore/lib/gc_sc/SoftDott.pl'
> MANIFEST did not declare 'lib/unicore/lib/gc_sc/Space.pl'
> MANIFEST did not declare 'lib/unicore/lib/gc_sc/SpacePer.pl'
> MANIFEST did not declare 'lib/unicore/lib/gc_sc/Sterm2.pl'
> MANIFEST did not declare 'lib/unicore/lib/gc_sc/SylotiNa.pl'
> MANIFEST did not declare 'lib/unicore/lib/gc_sc/Syrc.pl'
> MANIFEST did not declare 'lib/unicore/lib/gc_sc/Tagb.pl'
> MANIFEST did not declare 'lib/unicore/lib/gc_sc/TaiLe.pl'
> MANIFEST did not declare 'lib/unicore/lib/gc_sc/Taml.pl'
> MANIFEST did not declare 'lib/unicore/lib/gc_sc/Telu.pl'
> MANIFEST did not declare 'lib/unicore/lib/gc_sc/Term.pl'
> MANIFEST did not declare 'lib/unicore/lib/gc_sc/Terminal.pl'
> MANIFEST did not declare 'lib/unicore/lib/gc_sc/Tfng.pl'
> MANIFEST did not declare 'lib/unicore/lib/gc_sc/Tglg.pl'
> MANIFEST did not declare 'lib/unicore/lib/gc_sc/Thaa.pl'
> MANIFEST did not declare 'lib/unicore/lib/gc_sc/Thai.pl'
> MANIFEST did not declare 'lib/unicore/lib/gc_sc/Tibt.pl'
> MANIFEST did not declare 'lib/unicore/lib/gc_sc/Title.pl'
> MANIFEST did not declare 'lib/unicore/lib/gc_sc/UIdeo.pl'
> MANIFEST did not declare 'lib/unicore/lib/gc_sc/Ugar.pl'
> MANIFEST did not declare 'lib/unicore/lib/gc_sc/UnifiedI.pl'
> MANIFEST did not declare 'lib/unicore/lib/gc_sc/Upper.pl'
> MANIFEST did not declare 'lib/unicore/lib/gc_sc/Uppercas.pl'
> MANIFEST did not declare 'lib/unicore/lib/gc_sc/VS.pl'
> MANIFEST did not declare 'lib/unicore/lib/gc_sc/Variatio.pl'
> MANIFEST did not declare 'lib/unicore/lib/gc_sc/VertSpac.pl'
> MANIFEST did not declare 'lib/unicore/lib/gc_sc/WSpace.pl'
> MANIFEST did not declare 'lib/unicore/lib/gc_sc/WhiteSpa.pl'
> MANIFEST did not declare 'lib/unicore/lib/gc_sc/Word.pl'
> MANIFEST did not declare 'lib/unicore/lib/gc_sc/XDigit.pl'
> MANIFEST did not declare 'lib/unicore/lib/gc_sc/Xsux.pl'
> MANIFEST did not declare 'lib/unicore/lib/gc_sc/Yiii.pl'
> MANIFEST did not declare 'lib/unicore/lib/gc_sc/Z.pl'
> MANIFEST did not declare 'lib/unicore/lib/gc_sc/Zl.pl'
> MANIFEST did not declare 'lib/unicore/lib/gc_sc/Zp.pl'
> MANIFEST did not declare 'lib/unicore/lib/gc_sc/Zs.pl'
> MANIFEST did not declare 'lib/unicore/lib/gc_sc/Zyyy.pl'
> MANIFEST did not declare 'lib/unicore/lib/gc_sc/_CanonDC.pl'
> MANIFEST did not declare 'lib/unicore/lib/gc_sc/_CaseIgn.pl'
> MANIFEST did not declare 'lib/unicore/lib/gc_sc/_CombAbo.pl'
> MANIFEST did not declare 'lib/unicore/lib/hst/L.pl'
> MANIFEST did not declare 'lib/unicore/lib/hst/LV.pl'
> MANIFEST did not declare 'lib/unicore/lib/hst/LVT.pl'
> MANIFEST did not declare 'lib/unicore/lib/hst/T.pl'
> MANIFEST did not declare 'lib/unicore/lib/hst/V.pl'
> MANIFEST did not declare 'lib/unicore/lib/jt/C.pl'
> MANIFEST did not declare 'lib/unicore/lib/jt/D.pl'
> MANIFEST did not declare 'lib/unicore/lib/jt/R.pl'
> MANIFEST did not declare 'lib/unicore/lib/jt/U.pl'
> MANIFEST did not declare 'lib/unicore/lib/lb/AI.pl'
> MANIFEST did not declare 'lib/unicore/lib/lb/AL.pl'
> MANIFEST did not declare 'lib/unicore/lib/lb/B2.pl'
> MANIFEST did not declare 'lib/unicore/lib/lb/BA.pl'
> MANIFEST did not declare 'lib/unicore/lib/lb/BB.pl'
> MANIFEST did not declare 'lib/unicore/lib/lb/BK.pl'
> MANIFEST did not declare 'lib/unicore/lib/lb/CB.pl'
> MANIFEST did not declare 'lib/unicore/lib/lb/CL.pl'
> MANIFEST did not declare 'lib/unicore/lib/lb/CM.pl'
> MANIFEST did not declare 'lib/unicore/lib/lb/CR.pl'
> MANIFEST did not declare 'lib/unicore/lib/lb/EX.pl'
> MANIFEST did not declare 'lib/unicore/lib/lb/GL.pl'
> MANIFEST did not declare 'lib/unicore/lib/lb/H2.pl'
> MANIFEST did not declare 'lib/unicore/lib/lb/H3.pl'
> MANIFEST did not declare 'lib/unicore/lib/lb/HY.pl'
> MANIFEST did not declare 'lib/unicore/lib/lb/ID.pl'
> MANIFEST did not declare 'lib/unicore/lib/lb/IN.pl'
> MANIFEST did not declare 'lib/unicore/lib/lb/IS.pl'
> MANIFEST did not declare 'lib/unicore/lib/lb/JL.pl'
> MANIFEST did not declare 'lib/unicore/lib/lb/JT.pl'
> MANIFEST did not declare 'lib/unicore/lib/lb/JV.pl'
> MANIFEST did not declare 'lib/unicore/lib/lb/LF.pl'
> MANIFEST did not declare 'lib/unicore/lib/lb/NL.pl'
> MANIFEST did not declare 'lib/unicore/lib/lb/NS.pl'
> MANIFEST did not declare 'lib/unicore/lib/lb/NU.pl'
> MANIFEST did not declare 'lib/unicore/lib/lb/OP.pl'
> MANIFEST did not declare 'lib/unicore/lib/lb/PO.pl'
> MANIFEST did not declare 'lib/unicore/lib/lb/PR.pl'
> MANIFEST did not declare 'lib/unicore/lib/lb/QU.pl'
> MANIFEST did not declare 'lib/unicore/lib/lb/SA.pl'
> MANIFEST did not declare 'lib/unicore/lib/lb/SG.pl'
> MANIFEST did not declare 'lib/unicore/lib/lb/SP.pl'
> MANIFEST did not declare 'lib/unicore/lib/lb/SY.pl'
> MANIFEST did not declare 'lib/unicore/lib/lb/WJ.pl'
> MANIFEST did not declare 'lib/unicore/lib/lb/XX.pl'
> MANIFEST did not declare 'lib/unicore/lib/lb/ZW.pl'
> MANIFEST did not declare 'lib/unicore/lib/nt/De.pl'
> MANIFEST did not declare 'lib/unicore/lib/nt/Di.pl'
> MANIFEST did not declare 'lib/unicore/lib/nt/Nu.pl'
> MANIFEST did not declare 'makeaperl'
> MANIFEST did not declare 'makedepend'
> MANIFEST did not declare 'makedir'
> MANIFEST did not declare 'makefile'
> MANIFEST did not declare 'makefile.old'
> MANIFEST did not declare 'myconfig'
> MANIFEST did not declare 'patchlevel.bak'
> MANIFEST did not declare 'pod/Makefile'
> MANIFEST did not declare 't/rantests'
> MANIFEST did not declare 'writemain'
> 


-- 
H.Merijn Brand         Amsterdam Perl Mongers (http://amsterdam.pm.org/)
using & porting perl 5.6.2, 5.8.x, 5.9.x   on HP-UX 10.20, 11.00, 11.11,
& 11.23, SuSE 10.0 & 10.2, AIX 4.3 & 5.2, and Cygwin. http://qa.perl.org
http://mirrors.develooper.com/hpux/            http://www.test-smoke.org
                        http://www.goldmark.org/jeff/stupid-disclaimers/

Thread Previous


nntp.perl.org: Perl Programming lists via nntp and http.
Comments to Ask Bjørn Hansen at ask@perl.org | Group listing | About