develooper Front page | perl.perl5.porters | Postings from April 2007

Smoke [5.9.5] 30888 FAIL(F) linux 2.6.20-1.2307.fc5 [fedora] (i686/1 cpu)

From:
steve
Date:
April 11, 2007 02:04
Subject:
Smoke [5.9.5] 30888 FAIL(F) linux 2.6.20-1.2307.fc5 [fedora] (i686/1 cpu)
Message ID:
200704110903.l3B93tin024569@kirk.peters.homeunix.org
Automated smoke report for 5.9.5 patch 30888
kirk.peters.homeunix.org: Intel(R) Celeron(R) CPU 2.00GHz (GenuineIntel 1994MHz) (i686/1 cpu)
    on        linux - 2.6.20-1.2307.fc5 [fedora]
    using     suncc version
    smoketime 19 hours 33 minutes (average 1 hour 13 minutes)

Summary: FAIL(F)

O = OK  F = Failure(s), extended report at the bottom
X = Failure(s) under TEST but not under harness
? = still running or test results not (yet) available
Build failures during:       - = unknown or N/A
c = Configure, m = make, M = make (after miniperl), t = make test-prep

   30888     Configuration (common) -Dcc="suncc"
----------- ---------------------------------------------------------
O O O O     
O O O O     -Duse64bitint
O O O O     -Duselongdouble
O O O O     -Dusemorebits
F F F F     -Duseithreads
F F F F     -Duseithreads -Duse64bitint
F F F F     -Duseithreads -Duselongdouble
F F F F     -Duseithreads -Dusemorebits
| | | +----- PERLIO = perlio -DDEBUGGING
| | +------- PERLIO = stdio  -DDEBUGGING
| +--------- PERLIO = perlio
+----------- PERLIO = stdio

Locally applied patches:
    DEVEL
    SMOKE30888

Failures: (common-args) -Dcc="suncc"
[stdio/perlio] -Duseithreads
[stdio/perlio] -Duseithreads -Duse64bitint
[stdio/perlio] -Duseithreads -Duselongdouble
[stdio/perlio] -Duseithreads -Dusemorebits
    ../ext/IO/t/io_pipe.t...................FAILED 9-10
    ../ext/POSIX/t/posix.t..................FAILED 11-66
    ../ext/POSIX/t/sigaction.t..............FAILED 25-31
    ../ext/Socket/t/socketpair.t............FAILED 36-45
    ../ext/Storable/t/threads.t.............FAILED ??
    ../ext/Time/HiRes/t/HiRes.t.............FAILED 12-38
    ../ext/XS/APItest/t/my_cxt.t............FAILED ??
    ../ext/threads/shared/t/av_refs.t.......FAILED 2-14
    ../ext/threads/shared/t/av_simple.t.....FAILED 2-44
    ../ext/threads/shared/t/blessed.t.......FAILED 2-37
    ../ext/threads/shared/t/cond.t..........FAILED 2-32
    ../ext/threads/shared/t/hv_refs.t.......FAILED 2-20
    ../ext/threads/shared/t/hv_simple.t.....FAILED 2-16
    ../ext/threads/shared/t/shared_attr.t...FAILED 2-101
    ../ext/threads/shared/t/stress.t........FAILED 1-50
    ../ext/threads/shared/t/sv_refs.t.......FAILED 2-11
    ../ext/threads/shared/t/sv_simple.t.....FAILED 2-11
    ../ext/threads/shared/t/wait.t..........FAILED 6-103
    ../ext/threads/shared/t/waithires.t.....FAILED 2-63
    ../ext/threads/t/blocks.t...............FAILED 1-5
    ../ext/threads/t/context.t..............FAILED 1-31
    ../ext/threads/t/end.t..................FAILED 1-6
    ../ext/threads/t/exit.t.................FAILED 9-18
    ../ext/threads/t/free.t.................FAILED 1-29
    ../ext/threads/t/free2.t................FAILED 1-78
    ../ext/threads/t/join.t.................FAILED 1-20
    ../ext/threads/t/kill.t.................FAILED 1-19
    ../ext/threads/t/problems.t.............FAILED 2-15
    ../ext/threads/t/state.t................FAILED 1-59
    ../ext/threads/t/thread.t...............FAILED 4-31
    ../lib/Net/Ping/t/190_alarm.t...........FAILED 5-6
    ../lib/Test/Simple/t/diag.t.............FAILED ??
    ../lib/Test/Simple/t/overload_threads.t.FAILED ??
    ../lib/Test/Simple/t/sort_bug.t.........FAILED ??
    ../lib/Test/Simple/t/threads.t..........FAILED ??
    ../lib/Thread/Queue.t...................FAILED ??
    ../lib/warnings.t.......................FAILED 288
    ../t/io/pipe.t..........................FAILED 9-24
    ../t/op/alarm.t.........................FAILED ??
    ../t/op/getpid.t........................FAILED ??
    ../t/op/magic.t.........................FAILED 3-5
    ../t/op/reset.t.........................FAILED 21-24

[stdio] -DDEBUGGING -Duseithreads
[stdio/perlio] -DDEBUGGING -Duseithreads -Duse64bitint
[stdio/perlio] -DDEBUGGING -Duseithreads -Duselongdouble
[stdio/perlio] -DDEBUGGING -Duseithreads -Dusemorebits
    ../ext/Storable/t/threads.t.............FAILED ??
    ../ext/XS/APItest/t/my_cxt.t............FAILED ??
    ../ext/threads/shared/t/av_refs.t.......FAILED 2-14
    ../ext/threads/shared/t/av_simple.t.....FAILED 2-44
    ../ext/threads/shared/t/blessed.t.......FAILED 2-37
    ../ext/threads/shared/t/cond.t..........FAILED 2-32
    ../ext/threads/shared/t/hv_refs.t.......FAILED 2-20
    ../ext/threads/shared/t/hv_simple.t.....FAILED 2-16
    ../ext/threads/shared/t/shared_attr.t...FAILED 2-101
    ../ext/threads/shared/t/stress.t........FAILED 1-50
    ../ext/threads/shared/t/sv_refs.t.......FAILED 2-11
    ../ext/threads/shared/t/sv_simple.t.....FAILED 2-11
    ../ext/threads/shared/t/wait.t..........FAILED 6-103
    ../ext/threads/shared/t/waithires.t.....FAILED 2-63
    ../ext/threads/t/blocks.t...............FAILED 1-5
    ../ext/threads/t/context.t..............FAILED 1-31
    ../ext/threads/t/end.t..................FAILED 1-6
    ../ext/threads/t/exit.t.................FAILED 9-18
    ../ext/threads/t/free.t.................FAILED 1-29
    ../ext/threads/t/free2.t................FAILED 1-78
    ../ext/threads/t/join.t.................FAILED 1-20
    ../ext/threads/t/kill.t.................FAILED 1-19
    ../ext/threads/t/problems.t.............FAILED 2-15
    ../ext/threads/t/state.t................FAILED 1-59
    ../ext/threads/t/thread.t...............FAILED 4-31
    ../lib/Test/Simple/t/diag.t.............FAILED ??
    ../lib/Test/Simple/t/overload_threads.t.FAILED ??
    ../lib/Test/Simple/t/sort_bug.t.........FAILED ??
    ../lib/Test/Simple/t/threads.t..........FAILED ??
    ../lib/Thread/Queue.t...................FAILED ??
    ../t/op/getpid.t........................FAILED ??
    ../t/op/reset.t.........................FAILED 21-24

[perlio] -DDEBUGGING -Duseithreads
    ../ext/Storable/t/threads.t.............FAILED ??
    ../ext/XS/APItest/t/my_cxt.t............FAILED ??
    ../ext/threads/shared/t/av_refs.t.......FAILED 2-14
    ../ext/threads/shared/t/av_simple.t.....FAILED 2-44
    ../ext/threads/shared/t/blessed.t.......FAILED 2-37
    ../ext/threads/shared/t/cond.t..........FAILED 2-32
    ../ext/threads/shared/t/hv_refs.t.......FAILED 2-20
    ../ext/threads/shared/t/hv_simple.t.....FAILED 2-16
    ../ext/threads/shared/t/shared_attr.t...FAILED 2-101
    ../ext/threads/shared/t/stress.t........FAILED 1-50
    ../ext/threads/shared/t/sv_refs.t.......FAILED 2-11
    ../ext/threads/shared/t/sv_simple.t.....FAILED 2-11
    ../ext/threads/shared/t/wait.t..........FAILED 6-103
    ../ext/threads/shared/t/waithires.t.....FAILED 2-63
    ../ext/threads/t/blocks.t...............FAILED 1-5
    ../ext/threads/t/context.t..............FAILED 1-31
    ../ext/threads/t/end.t..................FAILED 1-6
    ../ext/threads/t/exit.t.................FAILED 9-18
    ../ext/threads/t/free.t.................FAILED 1-29
    ../ext/threads/t/free2.t................FAILED 1-78
    ../ext/threads/t/join.t.................FAILED 1-20
    ../ext/threads/t/kill.t.................FAILED 1-19
    ../ext/threads/t/problems.t.............FAILED 2-15
    ../ext/threads/t/state.t................FAILED 1-59
    ../ext/threads/t/thread.t...............FAILED 4-31
    ../lib/Test/Simple/t/diag.t.............FAILED ??
    ../lib/Test/Simple/t/overload_threads.t.FAILED ??
    ../lib/Test/Simple/t/sort_bug.t.........FAILED ??
    ../lib/Test/Simple/t/threads.t..........FAILED ??
    ../lib/Thread/Queue.t...................FAILED ??
    ../t/op/getpid.t........................FAILED ??
    ../t/op/reset.t.........................FAILED 21-24
Inconsistent test results (between TEST and harness):
    ../t/op/alarm.t.........................FAILED at test 4

-- 
Report by Test::Smoke v1.19_83 build 980 running on perl 5.8.8
(Reporter v0.026 / Smoker v0.029)




nntp.perl.org: Perl Programming lists via nntp and http.
Comments to Ask Bjørn Hansen at ask@perl.org | Group listing | About