develooper Front page | perl.perl5.porters | Postings from April 2007

[Fwd: Smoke [5.9.5] 30827 FAIL(F) OSF1 V5.1 (EV6/4 cpu)]

Thread Next
From:
Jarkko Hietaniemi
Date:
April 2, 2007 17:43
Subject:
[Fwd: Smoke [5.9.5] 30827 FAIL(F) OSF1 V5.1 (EV6/4 cpu)]
Message ID:
4611A32A.5030109@iki.fi
Somewhere between patch level 30791

http://www.nntp.perl.org/group/perl.daily-build.reports/2007/03/msg46329.html

and this (patch level 30827) the blead with g++ has started barfing
(as  in: core dump) in Tru64 (the Tru64 C++ compiler, cxx, is happy),
the crash is somewhere in yyparse() but the exact spot is still elusive,
for e.g. "./perl t/io/layers.t".

-------- Original Message --------
Subject: Smoke [5.9.5] 30827 FAIL(F) OSF1 V5.1 (EV6/4 cpu)
Date: Mon, 2 Apr 2007 08:03:09 +0300 (EEST)
From: Jarkko Hietaniemi <jhi@cc.hut.fi>
To: smokers-reports@perl.org
CC: jhi@iki.fi

Automated smoke report for 5.9.5 patch 30827
kosh.hut.fi: alpha EV6.7 (21264A) (EV6/4 cpu)
    on        OSF1 - V5.1
    using     cxx version V6.5-011
    smoketime 8 hours 40 minutes (average 1 hour 26 minutes)

Summary: FAIL(F)

O = OK  F = Failure(s), extended report at the bottom
X = Failure(s) under TEST but not under harness
? = still running or test results not (yet) available
Build failures during:       - = unknown or N/A
c = Configure, m = make, M = make (after miniperl), t = make test-prep

   30827     Configuration (common) -Dlocincpth=/p/include
-Dloclibpth=/p/lib
----------- ---------------------------------------------------------
O O O O O O -Dcc=cxx
F F F F F F -Dcc=g++
O O O O O O -DPERL_GLOBAL_STRUCT_PRIVATE
| | | | | +- LC_ALL = fi_FI.UTF-8 -DDEBUGGING
| | | | +--- PERLIO = perlio -DDEBUGGING
| | | +----- PERLIO = stdio  -DDEBUGGING
| | +------- LC_ALL = fi_FI.UTF-8
| +--------- PERLIO = perlio
+----------- PERLIO = stdio

Locally applied patches:
    DEVEL
    SMOKE30827

Failures: (common-args) -Dlocincpth=/p/include -Dloclibpth=/p/lib
[stdio] -Dcc=g++
    ../ext/IO/t/io_multihomed.t.............FAILED 2-8
    ../ext/IO/t/io_sock.t...................FAILED 2-26
    ../ext/IO/t/io_udp.t....................FAILED 3-7
    ../ext/Socket/t/Socket.t................FAILED 3-17
    ../lib/Net/Ping/t/450_service.t.........FAILED 4-26
    ../t/run/fresh_perl.t...................FAILED 94
Inconsistent test results (between TEST and harness):
    ../t/uni/tr_7jis.t......................FAILED--expected 6 tests, saw 0
    ../lib/Pod/t/man.t......................FAILED--expected 21 tests, saw 1
    ../ext/Encode/t/enc_eucjp.t.............FAILED--no leader found
    ../ext/Encode/t/Encode.t................FAILED--no leader found
    ../ext/Encode/t/utf8strict.t............FAILED--no leader found
    ../ext/Encode/t/enc_data.t..............FAILED--no leader found
    ../ext/Encode/t/at-tw.t.................FAILED--expected 17 tests, saw 0
    ../ext/Encode/t/jperl.t.................FAILED--expected 15 tests, saw 0
    ../t/io/layers.t........................FAILED--no leader found
    ../t/uni/tr_utf8.t......................FAILED--expected 8 tests, saw 0
    ../ext/PerlIO/t/encoding.t..............FAILED--no leader found
    ../t/uni/tr_eucjp.t.....................FAILED--expected 6 tests, saw 0
    ../ext/Encode/t/enc_module.t............FAILED--no leader found
    ../lib/encoding/warnings/t/3-normal.t...FAILED--expected 2 tests, saw 0
    ../ext/Encode/t/perlio.t................FAILED--expected 38 tests, saw 0
    ../lib/Pod/Simple/t/encod03.t...........FAILED--expected 4 tests, saw 1
    ../ext/Encode/t/from_to.t...............FAILED--expected 3 tests, saw 0
    ../ext/Encode/t/mime-header.t...........FAILED--expected 11 tests, saw 0
    ../ext/Encode/t/Aliases.t...............FAILED--no leader found
    ../lib/DBM_Filter/t/encode.t............FAILED--no leader found
    ../t/uni/tr_sjis.t......................FAILED--expected 6 tests, saw 0
    ../ext/Encode/t/gsm0338.t...............FAILED--expected 21 tests, saw 0
    ../lib/encoding/warnings/t/1-warning.t..FAILED--no leader found
    ../ext/Encode/t/at-cn.t.................FAILED--expected 29 tests, saw 0
    ../ext/Encode/t/grow.t..................FAILED--no leader found
    ../lib/Pod/Simple/t/corpus.t............FAILED--expected 49 tests, saw 1
    ../ext/PerlIO/t/fallback.t..............FAILED--no leader found
    ../ext/Encode/t/mime_header_iso2022jp.t.FAILED--expected 14 tests, saw 0
    ../lib/encoding/warnings/t/2-fatal.t....FAILED--no leader found
    ../t/op/ver.t...........................FAILED--no leader found
    ../ext/Encode/t/Unicode.t...............FAILED--expected 37 tests, saw 0
    ../t/uni/greek.t........................FAILED--no leader found
    ../lib/Pod/Simple/t/00about.t...........FAILED--expected 27 tests,
saw 24
    ../ext/Encode/t/Encoder.t...............FAILED--expected 516 tests,
saw 0
    ../t/uni/chomp.t........................FAILED--no leader found
    ../ext/Encode/t/enc_utf8.t..............FAILED--no leader found
    ../ext/Encode/t/guess.t.................FAILED--no leader found
    ../lib/Pod/Simple/t/encod02.t...........FAILED--expected 4 tests, saw 1
    ../ext/Encode/t/CJKT.t..................FAILED--expected 60 tests, saw 0
    ../lib/Net/hostent.t....................FAILED--expected 7 tests, saw 3
    ../ext/Encode/t/encoding.t..............FAILED--no leader found
    ../t/uni/latin2.t.......................FAILED--no leader found
    ../t/comp/utf.t.........................FAILED--no leader found
    ../ext/Encode/t/fallback.t..............FAILED--expected 44 tests, saw 0
    ../ext/Compress/Zlib/t/08encoding.t.....FAILED--no leader found
    ../lib/encoding/warnings/t/4-lexical.t..FAILED--expected 3 tests, saw 0
    ../lib/Pod/Simple/t/encod01.t...........FAILED--expected 6 tests, saw 0
    ../lib/DBM_Filter/t/utf8.t..............FAILED--no leader found
    ../t/uni/chr.t..........................FAILED--expected 6 tests, saw 0
    ../ext/PerlIO/encoding/t/nolooping.t....FAILED--expected 1 tests, saw 0

[perlio] -Dcc=g++
[stdio/perlio] -DDEBUGGING -Dcc=g++
    ../ext/IO/t/io_multihomed.t.............FAILED 2-8
    ../ext/IO/t/io_sock.t...................FAILED 2-26
    ../ext/IO/t/io_udp.t....................FAILED 3-7
    ../ext/Socket/t/Socket.t................FAILED 3-17
    ../lib/Net/Ping/t/450_service.t.........FAILED 4-26
    ../t/run/fresh_perl.t...................FAILED 94
Inconsistent test results (between TEST and harness):
    ../t/uni/tr_7jis.t......................FAILED--expected 6 tests, saw 0
    ../lib/Pod/t/man.t......................FAILED--expected 21 tests, saw 1
    ../ext/Encode/t/enc_eucjp.t.............FAILED--no leader found
    ../ext/Encode/t/Encode.t................FAILED--no leader found
    ../ext/Encode/t/utf8strict.t............FAILED--no leader found
    ../ext/Encode/t/at-tw.t.................FAILED--expected 17 tests, saw 0
    ../ext/Encode/t/enc_data.t..............FAILED--no leader found
    ../ext/Encode/t/jperl.t.................FAILED--expected 15 tests, saw 0
    ../t/io/layers.t........................FAILED--no leader found
    ../t/uni/tr_utf8.t......................FAILED--expected 8 tests, saw 0
    ../ext/PerlIO/t/encoding.t..............FAILED--no leader found
    ../t/uni/tr_eucjp.t.....................FAILED--expected 6 tests, saw 0
    ../ext/Encode/t/enc_module.t............FAILED--no leader found
    ../lib/encoding/warnings/t/3-normal.t...FAILED--expected 2 tests, saw 0
    ../ext/Encode/t/perlio.t................FAILED--expected 38 tests, saw 0
    ../lib/Pod/Simple/t/encod03.t...........FAILED--expected 4 tests, saw 1
    ../ext/Encode/t/from_to.t...............FAILED--expected 3 tests, saw 0
    ../ext/Encode/t/mime-header.t...........FAILED--expected 11 tests, saw 0
    ../ext/Encode/t/Aliases.t...............FAILED--no leader found
    ../lib/DBM_Filter/t/encode.t............FAILED--no leader found
    ../t/uni/tr_sjis.t......................FAILED--expected 6 tests, saw 0
    ../ext/Encode/t/gsm0338.t...............FAILED--expected 21 tests, saw 0
    ../lib/encoding/warnings/t/1-warning.t..FAILED--no leader found
    ../ext/Encode/t/at-cn.t.................FAILED--expected 29 tests, saw 0
    ../ext/Encode/t/grow.t..................FAILED--no leader found
    ../lib/Pod/Simple/t/corpus.t............FAILED--expected 49 tests, saw 1
    ../ext/PerlIO/t/fallback.t..............FAILED--no leader found
    ../ext/Encode/t/mime_header_iso2022jp.t.FAILED--expected 14 tests, saw 0
    ../t/op/ver.t...........................FAILED--no leader found
    ../lib/encoding/warnings/t/2-fatal.t....FAILED--no leader found
    ../ext/Encode/t/Unicode.t...............FAILED--expected 37 tests, saw 0
    ../t/uni/greek.t........................FAILED--no leader found
    ../lib/Pod/Simple/t/00about.t...........FAILED--expected 27 tests,
saw 24
    ../ext/Encode/t/Encoder.t...............FAILED--expected 516 tests,
saw 0
    ../t/uni/chomp.t........................FAILED--no leader found
    ../ext/Encode/t/enc_utf8.t..............FAILED--no leader found
    ../ext/Encode/t/guess.t.................FAILED--no leader found
    ../lib/Pod/Simple/t/encod02.t...........FAILED--expected 4 tests, saw 1
    ../ext/Encode/t/CJKT.t..................FAILED--expected 60 tests, saw 0
    ../lib/Net/hostent.t....................FAILED--expected 7 tests, saw 3
    ../t/uni/latin2.t.......................FAILED--no leader found
    ../ext/Encode/t/encoding.t..............FAILED--no leader found
    ../t/comp/utf.t.........................FAILED--no leader found
    ../ext/Compress/Zlib/t/08encoding.t.....FAILED--no leader found
    ../ext/Encode/t/fallback.t..............FAILED--expected 44 tests, saw 0
    ../lib/encoding/warnings/t/4-lexical.t..FAILED--expected 3 tests, saw 0
    ../lib/Pod/Simple/t/encod01.t...........FAILED--expected 6 tests, saw 0
    ../lib/DBM_Filter/t/utf8.t..............FAILED--no leader found
    ../t/uni/chr.t..........................FAILED--expected 6 tests, saw 0
    ../ext/PerlIO/encoding/t/nolooping.t....FAILED--expected 1 tests, saw 0

[fi_FI.UTF-8] -Dcc=g++
[fi_FI.UTF-8] -DDEBUGGING -Dcc=g++
    ../ext/IO/t/io_multihomed.t.............FAILED 2-8
    ../ext/IO/t/io_sock.t...................FAILED 2-26
    ../ext/IO/t/io_udp.t....................FAILED 3-7
    ../ext/Socket/t/Socket.t................FAILED 3-17
    ../lib/Net/Ping/t/450_service.t.........FAILED 4-26
    ../t/run/fresh_perl.t...................FAILED 94
Inconsistent test results (between TEST and harness):
    ../t/uni/tr_7jis.t......................FAILED--expected 6 tests, saw 0
    ../lib/Pod/t/man.t......................FAILED--expected 21 tests, saw 1
    ../ext/Encode/t/enc_eucjp.t.............FAILED--no leader found
    ../ext/Encode/t/Encode.t................FAILED--no leader found
    ../ext/Encode/t/utf8strict.t............FAILED--no leader found
    ../ext/Encode/t/at-tw.t.................FAILED--expected 17 tests, saw 0
    ../ext/Encode/t/enc_data.t..............FAILED--no leader found
    ../ext/Encode/t/jperl.t.................FAILED--expected 15 tests, saw 0
    ../t/io/layers.t........................FAILED--no leader found
    ../t/uni/tr_utf8.t......................FAILED--expected 8 tests, saw 0
    ../ext/PerlIO/t/encoding.t..............FAILED--no leader found
    ../t/uni/tr_eucjp.t.....................FAILED--expected 6 tests, saw 0
    ../lib/encoding/warnings/t/3-normal.t...FAILED--expected 2 tests, saw 0
    ../ext/Encode/t/perlio.t................FAILED--expected 38 tests, saw 0
    ../lib/Pod/Simple/t/encod03.t...........FAILED--expected 4 tests, saw 1
    ../ext/Encode/t/from_to.t...............FAILED--expected 3 tests, saw 0
    ../ext/Encode/t/mime-header.t...........FAILED--expected 11 tests, saw 0
    ../ext/Encode/t/Aliases.t...............FAILED--no leader found
    ../lib/DBM_Filter/t/encode.t............FAILED--no leader found
    ../t/uni/tr_sjis.t......................FAILED--expected 6 tests, saw 0
    ../ext/Encode/t/gsm0338.t...............FAILED--expected 21 tests, saw 0
    ../lib/encoding/warnings/t/1-warning.t..FAILED--no leader found
    ../ext/Encode/t/at-cn.t.................FAILED--expected 29 tests, saw 0
    ../ext/Encode/t/grow.t..................FAILED--no leader found
    ../lib/Pod/Simple/t/corpus.t............FAILED--expected 49 tests, saw 1
    ../ext/PerlIO/t/fallback.t..............FAILED--no leader found
    ../ext/Encode/t/mime_header_iso2022jp.t.FAILED--expected 14 tests, saw 0
    ../t/op/ver.t...........................FAILED--no leader found
    ../lib/encoding/warnings/t/2-fatal.t....FAILED--no leader found
    ../ext/Encode/t/Unicode.t...............FAILED--expected 37 tests, saw 0
    ../t/uni/greek.t........................FAILED--no leader found
    ../lib/Pod/Simple/t/00about.t...........FAILED--expected 27 tests,
saw 24
    ../ext/Encode/t/Encoder.t...............FAILED--expected 516 tests,
saw 0
    ../t/uni/chomp.t........................FAILED--no leader found
    ../ext/Encode/t/enc_utf8.t..............FAILED--no leader found
    ../ext/Encode/t/guess.t.................FAILED--no leader found
    ../lib/Pod/Simple/t/encod02.t...........FAILED--expected 4 tests, saw 1
    ../ext/Encode/t/CJKT.t..................FAILED--expected 60 tests, saw 0
    ../lib/Net/hostent.t....................FAILED--expected 7 tests, saw 3
    ../t/uni/latin2.t.......................FAILED--no leader found
    ../ext/Encode/t/encoding.t..............FAILED--no leader found
    ../t/comp/utf.t.........................FAILED--no leader found
    ../ext/Compress/Zlib/t/08encoding.t.....FAILED--no leader found
    ../ext/Encode/t/fallback.t..............FAILED--expected 44 tests, saw 0
    ../lib/encoding/warnings/t/4-lexical.t..FAILED--expected 3 tests, saw 0
    ../lib/Pod/Simple/t/encod01.t...........FAILED--expected 6 tests, saw 0
    ../lib/DBM_Filter/t/utf8.t..............FAILED--no leader found
    ../t/uni/chr.t..........................FAILED--expected 6 tests, saw 0
    ../ext/PerlIO/encoding/t/nolooping.t....FAILED--expected 1 tests, saw 0

-- 
Report by Test::Smoke v1.19_84 build 991 running on perl 5.8.3
(Reporter v0.026 / Smoker v0.030)


Thread Next


nntp.perl.org: Perl Programming lists via nntp and http.
Comments to Ask Bjørn Hansen at ask@perl.org | Group listing | About