develooper Front page | perl.perl5.porters | Postings from March 2007

Smoke [5.9.5] 30610 FAIL(F) Solaris 2.11 (i386/1 cpu)

From:
steve
Date:
March 19, 2007 19:52
Subject:
Smoke [5.9.5] 30610 FAIL(F) Solaris 2.11 (i386/1 cpu)
Message ID:
200703200250.l2K2oWNZ012438@sulu
Automated smoke report for 5.9.5 patch 30610
sulu:  (1700MHz) (i386/1 cpu)
    on        Solaris - 2.11
    using     /opt/SUNWspro12/bin/cc version Sun C 5.9 SunOS_i386 Build40_1 2007/02/08
    smoketime 1 day 13 hours 50 minutes (average 2 hours 21 minutes)

Summary: FAIL(F)

O = OK  F = Failure(s), extended report at the bottom
X = Failure(s) under TEST but not under harness
? = still running or test results not (yet) available
Build failures during:       - = unknown or N/A
c = Configure, m = make, M = make (after miniperl), t = make test-prep

   30610     Configuration (common) -Dcc=/opt/SUNWspro12/bin/cc
----------- ---------------------------------------------------------
O O O O O O 
O O O O O O -Duse64bitint
O O O O O O -Duselongdouble
O O O O O O -Dusemorebits
F F F F F F -Duseithreads
F F F F F F -Duseithreads -Duse64bitint
F F F F F F -Duseithreads -Duselongdouble
F F F F F F -Duseithreads -Dusemorebits
| | | | | +- LC_ALL = en_US.UTF-8 -DDEBUGGING
| | | | +--- PERLIO = perlio -DDEBUGGING
| | | +----- PERLIO = stdio  -DDEBUGGING
| | +------- LC_ALL = en_US.UTF-8
| +--------- PERLIO = perlio
+----------- PERLIO = stdio

Locally applied patches:
    DEVEL
    SMOKE30610

Failures: (common-args) -Dcc=/opt/SUNWspro12/bin/cc
[stdio/perlio/en_US.UTF-8] -Duseithreads
[stdio/perlio/en_US.UTF-8] -DDEBUGGING -Duseithreads
[stdio/perlio/en_US.UTF-8] -Duseithreads -Duse64bitint
[stdio/perlio/en_US.UTF-8] -DDEBUGGING -Duseithreads -Duse64bitint
[stdio/perlio/en_US.UTF-8] -Duseithreads -Duselongdouble
[stdio/perlio/en_US.UTF-8] -DDEBUGGING -Duseithreads -Duselongdouble
[stdio/perlio/en_US.UTF-8] -Duseithreads -Dusemorebits
[stdio/perlio/en_US.UTF-8] -DDEBUGGING -Duseithreads -Dusemorebits
    ../ext/Storable/t/threads.t.............FAILED ??
    ../ext/XS/APItest/t/my_cxt.t............FAILED ??
    ../ext/threads/shared/t/av_refs.t.......FAILED 2-14
    ../ext/threads/shared/t/av_simple.t.....FAILED 2-44
    ../ext/threads/shared/t/blessed.t.......FAILED 2-37
    ../ext/threads/shared/t/cond.t..........FAILED 2-82
    ../ext/threads/shared/t/hv_refs.t.......FAILED 2-20
    ../ext/threads/shared/t/hv_simple.t.....FAILED 2-16
    ../ext/threads/shared/t/shared_attr.t...FAILED 2-101
    ../ext/threads/shared/t/sv_refs.t.......FAILED 2-11
    ../ext/threads/shared/t/sv_simple.t.....FAILED 2-11
    ../ext/threads/shared/t/wait.t..........FAILED 6-103
    ../ext/threads/shared/t/waithires.t.....FAILED 2-63
    ../ext/threads/t/blocks.t...............FAILED 1-5
    ../ext/threads/t/context.t..............FAILED 1-31
    ../ext/threads/t/end.t..................FAILED 1-6
    ../ext/threads/t/exit.t.................FAILED 9-18
    ../ext/threads/t/free.t.................FAILED 1-29
    ../ext/threads/t/free2.t................FAILED 1-78
    ../ext/threads/t/join.t.................FAILED 1-20
    ../ext/threads/t/kill.t.................FAILED 1-19
    ../ext/threads/t/problems.t.............FAILED 2-15
    ../ext/threads/t/state.t................FAILED 1-59
    ../ext/threads/t/thread.t...............FAILED 4-31
    ../lib/Test/Simple/t/diag.t.............FAILED ??
    ../lib/Test/Simple/t/overload_threads.t.FAILED ??
    ../lib/Test/Simple/t/sort_bug.t.........FAILED ??
    ../lib/Test/Simple/t/threads.t..........FAILED ??
    ../lib/Thread/Queue.t...................FAILED ??
    ../t/op/getpid.t........................FAILED ??

Compiler messages(solaris):
"perly.y", line 531: warning: statement not reached
"util.c", line 1417: warning: statement not reached
"mg.c", line 312: warning: statement not reached
"pp_ctl.c", line 1292: warning: statement not reached
"pp_ctl.c", line 1565: warning: statement not reached
"pp_ctl.c", line 2645: warning: statement not reached
"regexec.c", line 1716: warning: statement not reached
"regexec.c", line 5041: warning: statement not reached
"perlio.c", line 800: warning: statement not reached
"perlio.c", line 4940: warning: statement not reached
"mathoms.c", line 691: warning: statement not reached
"pp_pack.c", line 915: warning: statement not reached
"RealPPPort.c", line 2615: warning: statement not reached
"MD5.xs", line 481: warning: statement not reached
"Encode.xs", line 29: warning: statement not reached
"Encode.xs", line 30: warning: statement not reached
"Encode.xs", line 184: warning: statement not reached
"Encode.xs", line 215: warning: statement not reached
"Encode.xs", line 253: warning: statement not reached
"NDBM_File.xs", line 82: warning: statement not reached
"POSIX.xs", line 392: warning: statement not reached
"SDBM_File.xs", line 86: warning: statement not reached
"Socket.xs", line 188: warning: statement not reached
"Syslog.xs", line 27: warning: statement not reached
"Syslog.xs", line 41: warning: statement not reached
"Syslog.xs", line 56: warning: statement not reached
"APItest.c", line 1123: warning: statement not reached
"re_exec.c", line 1716: warning: statement not reached
"re_exec.c", line 5041: warning: statement not reached
"util.c", line 1386: warning: statement not reached

-- 
Report by Test::Smoke v1.19_83 build 980 running on perl 5.8.4
(Reporter v0.026 / Smoker v0.029)




nntp.perl.org: Perl Programming lists via nntp and http.
Comments to Ask Bjørn Hansen at ask@perl.org | Group listing | About