develooper Front page | perl.perl5.porters | Postings from March 2007

Smoke [5.9.5] 30562 FAIL(F) linux 2.6.19-1.2288.2.4.fc5 [fedora] (i686/1 cpu)

From:
steve
Date:
March 14, 2007 00:46
Subject:
Smoke [5.9.5] 30562 FAIL(F) linux 2.6.19-1.2288.2.4.fc5 [fedora] (i686/1 cpu)
Message ID:
200703140745.l2E7jucH015978@kirk.peters.homeunix.org
Automated smoke report for 5.9.5 patch 30562
kirk.peters.homeunix.org: Intel(R) Celeron(R) CPU 2.00GHz (GenuineIntel 1994MHz) (i686/1 cpu)
    on        linux - 2.6.19-1.2288.2.4.fc5 [fedora]
    using     suncc version
    smoketime 15 hours 31 minutes (average 58 minutes 14 seconds)

Summary: FAIL(F)

O = OK  F = Failure(s), extended report at the bottom
X = Failure(s) under TEST but not under harness
? = still running or test results not (yet) available
Build failures during:       - = unknown or N/A
c = Configure, m = make, M = make (after miniperl), t = make test-prep

   30562     Configuration (common) -Dcc="suncc"
----------- ---------------------------------------------------------
F O F O     
F O F O     -Duse64bitint
F O F F     -Duselongdouble
F O F F     -Dusemorebits
F F F F     -Duseithreads
F F F F     -Duseithreads -Duse64bitint
F F F F     -Duseithreads -Duselongdouble
F F F F     -Duseithreads -Dusemorebits
| | | +----- PERLIO = perlio -DDEBUGGING
| | +------- PERLIO = stdio  -DDEBUGGING
| +--------- PERLIO = perlio
+----------- PERLIO = stdio

Locally applied patches:
    DEVEL
    SMOKE30562

Failures: (common-args) -Dcc="suncc"
[stdio] 
    ../ext/Compress/Zlib/t/14gzopen.t.......FAILED 139-217
    ../t/io/dup.t...........................FAILED 15-26
    ../t/io/open.t..........................FAILED 93
Inconsistent test results (between TEST and harness):
    ../ext/IO/Compress/Zlib/t/105oneshot-deflate.tFAILED--expected 970 tests, saw 173
    ../ext/IO/Compress/Zlib/t/100generic-zip.tFAILED--expected 641 tests, saw 81
    ../ext/IO/Compress/Zlib/t/100generic-rawdeflate.tFAILED--expected 641 tests, saw 81
    ../ext/IO/Compress/Zlib/t/105oneshot-zip.tFAILED--expected 970 tests, saw 173
    ../ext/IO/Compress/Zlib/t/100generic-deflate.tFAILED--expected 641 tests, saw 81
    ../ext/IO/Compress/Zlib/t/105oneshot-rawdeflate.tFAILED--expected 970 tests, saw 173
    ../ext/IO/Compress/Zlib/t/100generic-gzip.tFAILED--expected 641 tests, saw 81
    ../ext/IO/Compress/Zlib/t/105oneshot-gzip.tFAILED--expected 970 tests, saw 173

[stdio] -DDEBUGGING
[stdio] -Duse64bitint
[stdio] -DDEBUGGING -Duse64bitint
[stdio] -Duselongdouble
    ../ext/Compress/Zlib/t/14gzopen.t.......FAILED 139-217
    ../t/io/dup.t...........................FAILED 15-26
    ../t/io/open.t..........................FAILED 93
Inconsistent test results (between TEST and harness):
    ../ext/IO/Compress/Zlib/t/105oneshot-deflate.tFAILED--expected 970 tests, saw 173
    ../ext/IO/Compress/Zlib/t/100generic-zip.tFAILED--expected 641 tests, saw 81
    ../ext/IO/Compress/Zlib/t/100generic-rawdeflate.tFAILED--expected 641 tests, saw 81
    ../ext/IO/Compress/Zlib/t/100generic-deflate.tFAILED--expected 641 tests, saw 81
    ../ext/IO/Compress/Zlib/t/105oneshot-zip.tFAILED--expected 970 tests, saw 173
    ../ext/IO/Compress/Zlib/t/105oneshot-rawdeflate.tFAILED--expected 970 tests, saw 173
    ../ext/IO/Compress/Zlib/t/100generic-gzip.tFAILED--expected 641 tests, saw 81
    ../ext/IO/Compress/Zlib/t/105oneshot-gzip.tFAILED--expected 970 tests, saw 173

[stdio] -DDEBUGGING -Duselongdouble
    ../ext/B/t/concise-xs.t.................FAILED 812-1594
    ../ext/Compress/Zlib/t/14gzopen.t.......FAILED 139-217
    ../ext/DB_File/t/db-btree.t.............FAILED ??
    ../ext/DB_File/t/db-hash.t..............FAILED ??
    ../ext/DB_File/t/db-recno.t.............FAILED ??
    ../ext/IO/t/IO.t........................FAILED 5-18
    ../ext/IO/t/io_multihomed.t.............FAILED ??
    ../ext/IO/t/io_sock.t...................FAILED ??
    ../ext/IO/t/io_udp.t....................FAILED ??
    ../ext/IO/t/io_unix.t...................FAILED ??
    ../ext/IO/t/io_xs.t.....................FAILED ??
    ../ext/NDBM_File/t/ndbm.t...............FAILED ??
    ../ext/POSIX/t/posix.t..................FAILED ??
    ../ext/POSIX/t/sysconf.t................FAILED 1-87
    ../ext/Sys/Syslog/t/00-load.t...........FAILED 1
    ../ext/Sys/Syslog/t/constants.t.........FAILED 1-3 5 7 9 11
                                                   13 15 17 19 21
                                                   23 25 27 29 31
                                                   33 35 37 39 41
                                                   43 45 47 49 51
                                                   53 55 57 59 61
                                                   63 65 67 69 71
                                                   73 75 77 79 81
                                                   83 85 87
    ../ext/Sys/Syslog/t/syslog.t............FAILED 1 3-159
    ../lib/Locale/Codes/t/all.t.............FAILED ??
    ../lib/Net/Ping/t/100_load.t............FAILED 1
    ../lib/Net/Ping/t/110_icmp_inst.t.......FAILED ??
    ../lib/Net/Ping/t/120_udp_inst.t........FAILED ??
    ../lib/Net/Ping/t/130_tcp_inst.t........FAILED ??
    ../lib/Net/Ping/t/140_stream_inst.t.....FAILED ??
    ../lib/Net/Ping/t/150_syn_inst.t........FAILED ??
    ../lib/Net/Ping/t/190_alarm.t...........FAILED ??
    ../lib/Net/Ping/t/500_ping_icmp.t.......FAILED ??
    ../lib/Net/Ping/t/510_ping_udp.t........FAILED ??
    ../lib/Net/t/ftp.t......................FAILED ??
    ../lib/Net/t/nntp.t.....................FAILED ??
    ../lib/Net/t/require.t..................FAILED 5-9
    ../lib/Net/t/smtp.t.....................FAILED ??
    ../t/io/dup.t...........................FAILED 15-26
    ../t/io/open.t..........................FAILED 93
    ../t/lib/1_compile.t....................FAILED 3
    ../t/lib/proxy_constant_subs.t..........FAILED 5-8
    ../t/op/taint.t.........................FAILED ??
Inconsistent test results (between TEST and harness):
    ../ext/IO/Compress/Zlib/t/105oneshot-deflate.tFAILED--expected 970 tests, saw 173
    ../ext/IO/Compress/Zlib/t/100generic-rawdeflate.tFAILED--expected 641 tests, saw 81
    ../ext/IO/Compress/Zlib/t/105oneshot-zip.tFAILED--expected 970 tests, saw 173
    ../ext/IO/Compress/Zlib/t/105oneshot-rawdeflate.tFAILED--expected 970 tests, saw 173
    ../ext/IO/Compress/Zlib/t/105oneshot-gzip.tFAILED--expected 970 tests, saw 173
    ../lib/Memoize/t/speed.t................FAILED at test 2
    ../ext/IO/Compress/Zlib/t/100generic-zip.tFAILED--expected 641 tests, saw 81
    ../ext/IO/Compress/Zlib/t/100generic-gzip.tFAILED--expected 641 tests, saw 81
    ../ext/IO/Compress/Zlib/t/100generic-deflate.tFAILED--expected 641 tests, saw 81

[perlio] -DDEBUGGING -Duselongdouble
[perlio] -DDEBUGGING -Dusemorebits
    ../ext/B/t/concise-xs.t.................FAILED 812-1594
    ../ext/DB_File/t/db-btree.t.............FAILED ??
    ../ext/DB_File/t/db-hash.t..............FAILED ??
    ../ext/DB_File/t/db-recno.t.............FAILED ??
    ../ext/IO/t/IO.t........................FAILED 5-18
    ../ext/IO/t/io_multihomed.t.............FAILED ??
    ../ext/IO/t/io_sock.t...................FAILED ??
    ../ext/IO/t/io_udp.t....................FAILED ??
    ../ext/IO/t/io_unix.t...................FAILED ??
    ../ext/IO/t/io_xs.t.....................FAILED ??
    ../ext/NDBM_File/t/ndbm.t...............FAILED ??
    ../ext/POSIX/t/posix.t..................FAILED ??
    ../ext/POSIX/t/sysconf.t................FAILED 1-87
    ../ext/Sys/Syslog/t/00-load.t...........FAILED 1
    ../ext/Sys/Syslog/t/constants.t.........FAILED 1-3 5 7 9 11 13 15
                                                   17 19 21 23 25 27 29
                                                   31 33 35 37 39 41 43
                                                   45 47 49 51 53 55 57
                                                   59 61 63 65 67 69 71
                                                   73 75 77 79 81 83 85
                                                   87
    ../ext/Sys/Syslog/t/syslog.t............FAILED 1 3-159
    ../lib/Locale/Codes/t/all.t.............FAILED ??
    ../lib/Net/Ping/t/100_load.t............FAILED 1
    ../lib/Net/Ping/t/110_icmp_inst.t.......FAILED ??
    ../lib/Net/Ping/t/120_udp_inst.t........FAILED ??
    ../lib/Net/Ping/t/130_tcp_inst.t........FAILED ??
    ../lib/Net/Ping/t/140_stream_inst.t.....FAILED ??
    ../lib/Net/Ping/t/150_syn_inst.t........FAILED ??
    ../lib/Net/Ping/t/190_alarm.t...........FAILED ??
    ../lib/Net/Ping/t/500_ping_icmp.t.......FAILED ??
    ../lib/Net/Ping/t/510_ping_udp.t........FAILED ??
    ../lib/Net/t/ftp.t......................FAILED ??
    ../lib/Net/t/nntp.t.....................FAILED ??
    ../lib/Net/t/require.t..................FAILED 5-9
    ../lib/Net/t/smtp.t.....................FAILED ??
    ../t/lib/1_compile.t....................FAILED 3
    ../t/lib/proxy_constant_subs.t..........FAILED 5-8
    ../t/op/taint.t.........................FAILED ??

[stdio] -Dusemorebits
    ../ext/Compress/Zlib/t/14gzopen.t.......FAILED 139-217
    ../t/io/dup.t...........................FAILED 15-26
    ../t/io/open.t..........................FAILED 93
Inconsistent test results (between TEST and harness):
    ../ext/IO/Compress/Zlib/t/105oneshot-deflate.tFAILED--expected 970 tests, saw 173
    ../ext/IO/Compress/Zlib/t/100generic-rawdeflate.tFAILED--expected 641 tests, saw 81
    ../ext/IO/Compress/Zlib/t/105oneshot-zip.tFAILED--expected 970 tests, saw 173
    ../ext/IO/Compress/Zlib/t/105oneshot-rawdeflate.tFAILED--expected 970 tests, saw 173
    ../ext/IO/Compress/Zlib/t/105oneshot-gzip.tFAILED--expected 970 tests, saw 173
    ../ext/IO/Compress/Zlib/t/100generic-zip.tFAILED--expected 641 tests, saw 81
    ../ext/IO/Compress/Zlib/t/100generic-gzip.tFAILED--expected 641 tests, saw 81
    ../ext/IO/Compress/Zlib/t/100generic-deflate.tFAILED--expected 641 tests, saw 81

[stdio] -DDEBUGGING -Dusemorebits
    ../ext/B/t/concise-xs.t.................FAILED 812-1594
    ../ext/Compress/Zlib/t/14gzopen.t.......FAILED 139-217
    ../ext/DB_File/t/db-btree.t.............FAILED ??
    ../ext/DB_File/t/db-hash.t..............FAILED ??
    ../ext/DB_File/t/db-recno.t.............FAILED ??
    ../ext/IO/t/IO.t........................FAILED 5-18
    ../ext/IO/t/io_multihomed.t.............FAILED ??
    ../ext/IO/t/io_sock.t...................FAILED ??
    ../ext/IO/t/io_udp.t....................FAILED ??
    ../ext/IO/t/io_unix.t...................FAILED ??
    ../ext/IO/t/io_xs.t.....................FAILED ??
    ../ext/NDBM_File/t/ndbm.t...............FAILED ??
    ../ext/POSIX/t/posix.t..................FAILED ??
    ../ext/POSIX/t/sysconf.t................FAILED 1-87
    ../ext/Sys/Syslog/t/00-load.t...........FAILED 1
    ../ext/Sys/Syslog/t/constants.t.........FAILED 1-3 5 7 9 11
                                                   13 15 17 19 21
                                                   23 25 27 29 31
                                                   33 35 37 39 41
                                                   43 45 47 49 51
                                                   53 55 57 59 61
                                                   63 65 67 69 71
                                                   73 75 77 79 81
                                                   83 85 87
    ../ext/Sys/Syslog/t/syslog.t............FAILED 1 3-159
    ../lib/Locale/Codes/t/all.t.............FAILED ??
    ../lib/Net/Ping/t/100_load.t............FAILED 1
    ../lib/Net/Ping/t/110_icmp_inst.t.......FAILED ??
    ../lib/Net/Ping/t/120_udp_inst.t........FAILED ??
    ../lib/Net/Ping/t/130_tcp_inst.t........FAILED ??
    ../lib/Net/Ping/t/140_stream_inst.t.....FAILED ??
    ../lib/Net/Ping/t/150_syn_inst.t........FAILED ??
    ../lib/Net/Ping/t/190_alarm.t...........FAILED ??
    ../lib/Net/Ping/t/500_ping_icmp.t.......FAILED ??
    ../lib/Net/Ping/t/510_ping_udp.t........FAILED ??
    ../lib/Net/t/ftp.t......................FAILED ??
    ../lib/Net/t/nntp.t.....................FAILED ??
    ../lib/Net/t/require.t..................FAILED 5-9
    ../lib/Net/t/smtp.t.....................FAILED ??
    ../t/io/dup.t...........................FAILED 15-26
    ../t/io/open.t..........................FAILED 93
    ../t/lib/1_compile.t....................FAILED 3
    ../t/lib/proxy_constant_subs.t..........FAILED 5-8
    ../t/op/taint.t.........................FAILED ??
Inconsistent test results (between TEST and harness):
    ../ext/IO/Compress/Zlib/t/105oneshot-deflate.tFAILED--expected 970 tests, saw 173
    ../ext/IO/Compress/Zlib/t/100generic-rawdeflate.tFAILED--expected 641 tests, saw 81
    ../ext/IO/Compress/Zlib/t/105oneshot-zip.tFAILED--expected 970 tests, saw 173
    ../ext/IO/Compress/Zlib/t/105oneshot-rawdeflate.tFAILED--expected 970 tests, saw 173
    ../ext/IO/Compress/Zlib/t/105oneshot-gzip.tFAILED--expected 970 tests, saw 173
    ../ext/IO/Compress/Zlib/t/100generic-zip.tFAILED--expected 641 tests, saw 81
    ../ext/IO/Compress/Zlib/t/100generic-gzip.tFAILED--expected 641 tests, saw 81
    ../ext/IO/Compress/Zlib/t/100generic-deflate.tFAILED--expected 641 tests, saw 81

[stdio] -Duseithreads
    ../ext/Compress/Zlib/t/14gzopen.t.......FAILED 139-217
    ../ext/Hash/Util/FieldHash/t/03_class.t.FAILED 3-7
    ../ext/Hash/Util/FieldHash/t/04_thread.tFAILED 7-30
    ../ext/IO/t/io_pipe.t...................FAILED 9-10
    ../ext/POSIX/t/posix.t..................FAILED 11-66
    ../ext/POSIX/t/sigaction.t..............FAILED 25-31
    ../ext/Socket/t/socketpair.t............FAILED 36-45
    ../ext/Storable/t/threads.t.............FAILED ??
    ../ext/Time/HiRes/t/HiRes.t.............FAILED 12-38
    ../ext/XS/APItest/t/my_cxt.t............FAILED ??
    ../ext/threads/shared/t/av_refs.t.......FAILED 2-14
    ../ext/threads/shared/t/av_simple.t.....FAILED 2-44
    ../ext/threads/shared/t/blessed.t.......FAILED 2-37
    ../ext/threads/shared/t/cond.t..........FAILED 2-82
    ../ext/threads/shared/t/hv_refs.t.......FAILED 2-20
    ../ext/threads/shared/t/hv_simple.t.....FAILED 2-16
    ../ext/threads/shared/t/no_share.t......FAILED 4-6
    ../ext/threads/shared/t/shared_attr.t...FAILED 2-101
    ../ext/threads/shared/t/sv_refs.t.......FAILED 2-11
    ../ext/threads/shared/t/sv_simple.t.....FAILED 2-11
    ../ext/threads/shared/t/wait.t..........FAILED 6-103
    ../ext/threads/t/basic.t................FAILED 3-33
    ../ext/threads/t/blocks.t...............FAILED 1-5
    ../ext/threads/t/context.t..............FAILED 1-31
    ../ext/threads/t/end.t..................FAILED 1-6
    ../ext/threads/t/err.t..................FAILED 2-10
    ../ext/threads/t/exit.t.................FAILED 2-18
    ../ext/threads/t/free.t.................FAILED 1-29
    ../ext/threads/t/free2.t................FAILED 1-78
    ../ext/threads/t/join.t.................FAILED 1-20
    ../ext/threads/t/kill.t.................FAILED ??
    ../ext/threads/t/libc.t.................FAILED 2-11
    ../ext/threads/t/list.t.................FAILED 3-15
    ../ext/threads/t/problems.t.............FAILED 2-15
    ../ext/threads/t/stack.t................FAILED 5-18
    ../ext/threads/t/state.t................FAILED 1-59
    ../ext/threads/t/stress_cv.t............FAILED 3-63
    ../ext/threads/t/stress_re.t............FAILED 2-31
    ../ext/threads/t/stress_string.t........FAILED 3-63
    ../ext/threads/t/thread.t...............FAILED 2-31
    ../lib/Net/Ping/t/190_alarm.t...........FAILED 5-6
    ../lib/Test/Simple/t/diag.t.............FAILED ??
    ../lib/Test/Simple/t/overload_threads.t.FAILED ??
    ../lib/Test/Simple/t/sort_bug.t.........FAILED ??
    ../lib/Test/Simple/t/threads.t..........FAILED ??
    ../lib/Thread/Queue.t...................FAILED ??
    ../lib/vars.t...........................FAILED 17-27
    ../lib/warnings.t.......................FAILED 288
    ../t/io/dup.t...........................FAILED 15-26
    ../t/io/open.t..........................FAILED 93
    ../t/io/pipe.t..........................FAILED 9-24
    ../t/op/alarm.t.........................FAILED ??
    ../t/op/getpid.t........................FAILED ??
    ../t/op/magic.t.........................FAILED 3-5
    ../t/op/threads.t.......................FAILED 1-6
Inconsistent test results (between TEST and harness):
    ../ext/IO/Compress/Zlib/t/105oneshot-deflate.tFAILED--expected 970 tests, saw 173
    ../ext/IO/Compress/Zlib/t/100generic-rawdeflate.tFAILED--expected 641 tests, saw 81
    ../ext/IO/Compress/Zlib/t/105oneshot-zip.tFAILED--expected 970 tests, saw 173
    ../ext/IO/Compress/Zlib/t/105oneshot-rawdeflate.tFAILED--expected 970 tests, saw 173
    ../ext/IO/Compress/Zlib/t/105oneshot-gzip.tFAILED--expected 970 tests, saw 173
    ../ext/IO/Compress/Zlib/t/100generic-zip.tFAILED--expected 641 tests, saw 81
    ../ext/IO/Compress/Zlib/t/100generic-gzip.tFAILED--expected 641 tests, saw 81
    ../ext/IO/Compress/Zlib/t/100generic-deflate.tFAILED--expected 641 tests, saw 81

[perlio] -Duseithreads
[perlio] -Duseithreads -Duselongdouble
[perlio] -Duseithreads -Dusemorebits
    ../ext/IO/t/io_pipe.t...................FAILED 9-10
    ../ext/POSIX/t/posix.t..................FAILED 11-66
    ../ext/POSIX/t/sigaction.t..............FAILED 25-31
    ../ext/Socket/t/socketpair.t............FAILED 36-45
    ../ext/Storable/t/threads.t.............FAILED ??
    ../ext/Time/HiRes/t/HiRes.t.............FAILED 12-38
    ../ext/XS/APItest/t/my_cxt.t............FAILED ??
    ../ext/threads/shared/t/av_refs.t.......FAILED 2-14
    ../ext/threads/shared/t/av_simple.t.....FAILED 2-44
    ../ext/threads/shared/t/blessed.t.......FAILED 2-37
    ../ext/threads/shared/t/cond.t..........FAILED 2-82
    ../ext/threads/shared/t/hv_refs.t.......FAILED 2-20
    ../ext/threads/shared/t/hv_simple.t.....FAILED 2-16
    ../ext/threads/shared/t/shared_attr.t...FAILED 2-101
    ../ext/threads/shared/t/sv_refs.t.......FAILED 2-11
    ../ext/threads/shared/t/sv_simple.t.....FAILED 2-11
    ../ext/threads/shared/t/wait.t..........FAILED 6-103
    ../ext/threads/t/blocks.t...............FAILED 1-5
    ../ext/threads/t/context.t..............FAILED 1-31
    ../ext/threads/t/end.t..................FAILED 1-6
    ../ext/threads/t/exit.t.................FAILED 9-18
    ../ext/threads/t/free.t.................FAILED 1-29
    ../ext/threads/t/free2.t................FAILED 1-78
    ../ext/threads/t/join.t.................FAILED 1-20
    ../ext/threads/t/kill.t.................FAILED 1-19
    ../ext/threads/t/problems.t.............FAILED 2-15
    ../ext/threads/t/state.t................FAILED 1-59
    ../ext/threads/t/thread.t...............FAILED 4-31
    ../lib/Net/Ping/t/190_alarm.t...........FAILED 5-6
    ../lib/Test/Simple/t/diag.t.............FAILED ??
    ../lib/Test/Simple/t/overload_threads.t.FAILED ??
    ../lib/Test/Simple/t/sort_bug.t.........FAILED ??
    ../lib/Test/Simple/t/threads.t..........FAILED ??
    ../lib/Thread/Queue.t...................FAILED ??
    ../lib/warnings.t.......................FAILED 288
    ../t/io/pipe.t..........................FAILED 9-24
    ../t/op/alarm.t.........................FAILED ??
    ../t/op/getpid.t........................FAILED ??
    ../t/op/magic.t.........................FAILED 3-5

[stdio] -DDEBUGGING -Duseithreads
[stdio] -DDEBUGGING -Duseithreads -Duse64bitint
    ../ext/Compress/Zlib/t/14gzopen.t.......FAILED 139-217
    ../ext/Hash/Util/FieldHash/t/03_class.t.FAILED 3-7
    ../ext/Hash/Util/FieldHash/t/04_thread.tFAILED 7-30
    ../ext/Storable/t/threads.t.............FAILED ??
    ../ext/XS/APItest/t/my_cxt.t............FAILED ??
    ../ext/threads/shared/t/av_refs.t.......FAILED 2-14
    ../ext/threads/shared/t/av_simple.t.....FAILED 2-44
    ../ext/threads/shared/t/blessed.t.......FAILED 2-37
    ../ext/threads/shared/t/cond.t..........FAILED 2-82
    ../ext/threads/shared/t/hv_refs.t.......FAILED 2-20
    ../ext/threads/shared/t/hv_simple.t.....FAILED 2-16
    ../ext/threads/shared/t/no_share.t......FAILED 4-6
    ../ext/threads/shared/t/shared_attr.t...FAILED 2-101
    ../ext/threads/shared/t/sv_refs.t.......FAILED 2-11
    ../ext/threads/shared/t/sv_simple.t.....FAILED 2-11
    ../ext/threads/shared/t/wait.t..........FAILED 6-103
    ../ext/threads/t/basic.t................FAILED 3-33
    ../ext/threads/t/blocks.t...............FAILED 1-5
    ../ext/threads/t/context.t..............FAILED 1-31
    ../ext/threads/t/end.t..................FAILED 1-6
    ../ext/threads/t/err.t..................FAILED 2-10
    ../ext/threads/t/exit.t.................FAILED 2-18
    ../ext/threads/t/free.t.................FAILED 1-29
    ../ext/threads/t/free2.t................FAILED 1-78
    ../ext/threads/t/join.t.................FAILED 1-20
    ../ext/threads/t/kill.t.................FAILED ??
    ../ext/threads/t/libc.t.................FAILED 2-11
    ../ext/threads/t/list.t.................FAILED 3-15
    ../ext/threads/t/problems.t.............FAILED 2-15
    ../ext/threads/t/stack.t................FAILED 5-18
    ../ext/threads/t/state.t................FAILED 1-59
    ../ext/threads/t/stress_cv.t............FAILED 3-63
    ../ext/threads/t/stress_re.t............FAILED 2-31
    ../ext/threads/t/stress_string.t........FAILED 3-63
    ../ext/threads/t/thread.t...............FAILED 2-31
    ../lib/Test/Simple/t/diag.t.............FAILED ??
    ../lib/Test/Simple/t/overload_threads.t.FAILED ??
    ../lib/Test/Simple/t/sort_bug.t.........FAILED ??
    ../lib/Test/Simple/t/threads.t..........FAILED ??
    ../lib/Thread/Queue.t...................FAILED ??
    ../t/io/dup.t...........................FAILED 15-26
    ../t/io/open.t..........................FAILED 93
    ../t/op/getpid.t........................FAILED ??
    ../t/op/threads.t.......................FAILED 1-6
Inconsistent test results (between TEST and harness):
    ../ext/IO/Compress/Zlib/t/105oneshot-deflate.tFAILED--expected 970 tests, saw 173
    ../ext/IO/Compress/Zlib/t/100generic-rawdeflate.tFAILED--expected 641 tests, saw 81
    ../ext/IO/Compress/Zlib/t/105oneshot-zip.tFAILED--expected 970 tests, saw 173
    ../ext/IO/Compress/Zlib/t/105oneshot-rawdeflate.tFAILED--expected 970 tests, saw 173
    ../ext/IO/Compress/Zlib/t/105oneshot-gzip.tFAILED--expected 970 tests, saw 173
    ../ext/IO/Compress/Zlib/t/100generic-zip.tFAILED--expected 641 tests, saw 81
    ../ext/IO/Compress/Zlib/t/100generic-gzip.tFAILED--expected 641 tests, saw 81
    ../ext/IO/Compress/Zlib/t/100generic-deflate.tFAILED--expected 641 tests, saw 81

[perlio] -DDEBUGGING -Duseithreads
[perlio] -DDEBUGGING -Duseithreads -Duse64bitint
    ../ext/Storable/t/threads.t.............FAILED ??
    ../ext/XS/APItest/t/my_cxt.t............FAILED ??
    ../ext/threads/shared/t/av_refs.t.......FAILED 2-14
    ../ext/threads/shared/t/av_simple.t.....FAILED 2-44
    ../ext/threads/shared/t/blessed.t.......FAILED 2-37
    ../ext/threads/shared/t/cond.t..........FAILED 2-82
    ../ext/threads/shared/t/hv_refs.t.......FAILED 2-20
    ../ext/threads/shared/t/hv_simple.t.....FAILED 2-16
    ../ext/threads/shared/t/shared_attr.t...FAILED 2-101
    ../ext/threads/shared/t/sv_refs.t.......FAILED 2-11
    ../ext/threads/shared/t/sv_simple.t.....FAILED 2-11
    ../ext/threads/shared/t/wait.t..........FAILED 6-103
    ../ext/threads/t/blocks.t...............FAILED 1-5
    ../ext/threads/t/context.t..............FAILED 1-31
    ../ext/threads/t/end.t..................FAILED 1-6
    ../ext/threads/t/exit.t.................FAILED 9-18
    ../ext/threads/t/free.t.................FAILED 1-29
    ../ext/threads/t/free2.t................FAILED 1-78
    ../ext/threads/t/join.t.................FAILED 1-20
    ../ext/threads/t/kill.t.................FAILED 1-19
    ../ext/threads/t/problems.t.............FAILED 2-15
    ../ext/threads/t/state.t................FAILED 1-59
    ../ext/threads/t/thread.t...............FAILED 4-31
    ../lib/Test/Simple/t/diag.t.............FAILED ??
    ../lib/Test/Simple/t/overload_threads.t.FAILED ??
    ../lib/Test/Simple/t/sort_bug.t.........FAILED ??
    ../lib/Test/Simple/t/threads.t..........FAILED ??
    ../lib/Thread/Queue.t...................FAILED ??
    ../t/op/getpid.t........................FAILED ??

[stdio] -Duseithreads -Duse64bitint
[stdio] -Duseithreads -Duselongdouble
    ../ext/Compress/Zlib/t/14gzopen.t.......FAILED 139-217
    ../ext/Hash/Util/FieldHash/t/03_class.t.FAILED 3-7
    ../ext/Hash/Util/FieldHash/t/04_thread.tFAILED 7-30
    ../ext/IO/t/io_pipe.t...................FAILED 9-10
    ../ext/POSIX/t/posix.t..................FAILED 11-66
    ../ext/POSIX/t/sigaction.t..............FAILED 25-31
    ../ext/Socket/t/socketpair.t............FAILED 36-45
    ../ext/Storable/t/threads.t.............FAILED ??
    ../ext/Time/HiRes/t/HiRes.t.............FAILED 12-38
    ../ext/XS/APItest/t/my_cxt.t............FAILED ??
    ../ext/threads/shared/t/av_refs.t.......FAILED 2-14
    ../ext/threads/shared/t/av_simple.t.....FAILED 2-44
    ../ext/threads/shared/t/blessed.t.......FAILED 2-37
    ../ext/threads/shared/t/cond.t..........FAILED 2-82
    ../ext/threads/shared/t/hv_refs.t.......FAILED 2-20
    ../ext/threads/shared/t/hv_simple.t.....FAILED 2-16
    ../ext/threads/shared/t/no_share.t......FAILED 4-6
    ../ext/threads/shared/t/shared_attr.t...FAILED 2-101
    ../ext/threads/shared/t/sv_refs.t.......FAILED 2-11
    ../ext/threads/shared/t/sv_simple.t.....FAILED 2-11
    ../ext/threads/shared/t/wait.t..........FAILED 6-103
    ../ext/threads/t/basic.t................FAILED 3-33
    ../ext/threads/t/blocks.t...............FAILED 1-5
    ../ext/threads/t/context.t..............FAILED 1-31
    ../ext/threads/t/end.t..................FAILED 1-6
    ../ext/threads/t/err.t..................FAILED 2-10
    ../ext/threads/t/exit.t.................FAILED 2-18
    ../ext/threads/t/free.t.................FAILED 1-29
    ../ext/threads/t/free2.t................FAILED 1-78
    ../ext/threads/t/join.t.................FAILED 1-20
    ../ext/threads/t/kill.t.................FAILED ??
    ../ext/threads/t/libc.t.................FAILED 2-11
    ../ext/threads/t/list.t.................FAILED 3-15
    ../ext/threads/t/problems.t.............FAILED 2-15
    ../ext/threads/t/stack.t................FAILED 5-18
    ../ext/threads/t/state.t................FAILED 1-59
    ../ext/threads/t/stress_cv.t............FAILED 3-63
    ../ext/threads/t/stress_re.t............FAILED 2-31
    ../ext/threads/t/stress_string.t........FAILED 3-63
    ../ext/threads/t/thread.t...............FAILED 2-31
    ../lib/Net/Ping/t/190_alarm.t...........FAILED 5-6
    ../lib/Test/Simple/t/diag.t.............FAILED ??
    ../lib/Test/Simple/t/overload_threads.t.FAILED ??
    ../lib/Test/Simple/t/sort_bug.t.........FAILED ??
    ../lib/Test/Simple/t/threads.t..........FAILED ??
    ../lib/Thread/Queue.t...................FAILED ??
    ../lib/warnings.t.......................FAILED 288
    ../t/io/dup.t...........................FAILED 15-26
    ../t/io/open.t..........................FAILED 93
    ../t/io/pipe.t..........................FAILED 9-24
    ../t/op/alarm.t.........................FAILED ??
    ../t/op/getpid.t........................FAILED ??
    ../t/op/magic.t.........................FAILED 3-5
    ../t/op/threads.t.......................FAILED 1-6
Inconsistent test results (between TEST and harness):
    ../ext/IO/Compress/Zlib/t/105oneshot-deflate.tFAILED--expected 970 tests, saw 173
    ../ext/IO/Compress/Zlib/t/100generic-rawdeflate.tFAILED--expected 641 tests, saw 81
    ../ext/IO/Compress/Zlib/t/105oneshot-zip.tFAILED--expected 970 tests, saw 173
    ../ext/IO/Compress/Zlib/t/105oneshot-rawdeflate.tFAILED--expected 970 tests, saw 173
    ../ext/IO/Compress/Zlib/t/105oneshot-gzip.tFAILED--expected 970 tests, saw 173
    ../ext/IO/Compress/Zlib/t/100generic-zip.tFAILED--expected 641 tests, saw 81
    ../ext/IO/Compress/Zlib/t/100generic-gzip.tFAILED--expected 641 tests, saw 81
    ../ext/IO/Compress/Zlib/t/100generic-deflate.tFAILED--expected 641 tests, saw 81

[perlio] -Duseithreads -Duse64bitint
    ../ext/IO/t/io_pipe.t...................FAILED 9-10
    ../ext/POSIX/t/posix.t..................FAILED 11-66
    ../ext/POSIX/t/sigaction.t..............FAILED 25-31
    ../ext/Socket/t/socketpair.t............FAILED 36-45
    ../ext/Storable/t/threads.t.............FAILED ??
    ../ext/Time/HiRes/t/HiRes.t.............FAILED 12-38
    ../ext/XS/APItest/t/my_cxt.t............FAILED ??
    ../ext/threads/shared/t/av_refs.t.......FAILED 2-14
    ../ext/threads/shared/t/av_simple.t.....FAILED 2-44
    ../ext/threads/shared/t/blessed.t.......FAILED 2-37
    ../ext/threads/shared/t/cond.t..........FAILED 2-82
    ../ext/threads/shared/t/hv_refs.t.......FAILED 2-20
    ../ext/threads/shared/t/hv_simple.t.....FAILED 2-16
    ../ext/threads/shared/t/shared_attr.t...FAILED 2-101
    ../ext/threads/shared/t/sv_refs.t.......FAILED 2-11
    ../ext/threads/shared/t/sv_simple.t.....FAILED 2-11
    ../ext/threads/shared/t/wait.t..........FAILED 6-103
    ../ext/threads/t/blocks.t...............FAILED 1-5
    ../ext/threads/t/context.t..............FAILED 1-31
    ../ext/threads/t/end.t..................FAILED 1-6
    ../ext/threads/t/exit.t.................FAILED 9-18
    ../ext/threads/t/free.t.................FAILED 1-29
    ../ext/threads/t/free2.t................FAILED 1-78
    ../ext/threads/t/join.t.................FAILED 1-20
    ../ext/threads/t/kill.t.................FAILED 1-19
    ../ext/threads/t/problems.t.............FAILED 2-15
    ../ext/threads/t/state.t................FAILED 1-59
    ../ext/threads/t/thread.t...............FAILED 4-31
    ../lib/Net/Ping/t/190_alarm.t...........FAILED 5-6
    ../lib/Test/Simple/t/diag.t.............FAILED ??
    ../lib/Test/Simple/t/overload_threads.t.FAILED ??
    ../lib/Test/Simple/t/sort_bug.t.........FAILED ??
    ../lib/Test/Simple/t/threads.t..........FAILED ??
    ../lib/Thread/Queue.t...................FAILED ??
    ../lib/warnings.t.......................FAILED 288
    ../t/io/pipe.t..........................FAILED 9-24
    ../t/op/alarm.t.........................FAILED ??
    ../t/op/getpid.t........................FAILED ??
    ../t/op/magic.t.........................FAILED 3-5
Inconsistent test results (between TEST and harness):
    ../lib/vars.t...........................FAILED--expected 27 tests, saw 16

[stdio] -DDEBUGGING -Duseithreads -Duselongdouble
[stdio] -DDEBUGGING -Duseithreads -Dusemorebits
    ../ext/B/t/concise-xs.t.................FAILED 812-1594
    ../ext/Compress/Zlib/t/14gzopen.t.......FAILED 139-217
    ../ext/DB_File/t/db-btree.t.............FAILED ??
    ../ext/DB_File/t/db-hash.t..............FAILED ??
    ../ext/DB_File/t/db-recno.t.............FAILED ??
    ../ext/Hash/Util/FieldHash/t/03_class.t.FAILED 3-7
    ../ext/Hash/Util/FieldHash/t/04_thread.tFAILED 7-30
    ../ext/IO/t/IO.t........................FAILED 5-18
    ../ext/IO/t/io_multihomed.t.............FAILED ??
    ../ext/IO/t/io_sock.t...................FAILED ??
    ../ext/IO/t/io_udp.t....................FAILED ??
    ../ext/IO/t/io_unix.t...................FAILED ??
    ../ext/IO/t/io_xs.t.....................FAILED ??
    ../ext/NDBM_File/t/ndbm.t...............FAILED ??
    ../ext/POSIX/t/posix.t..................FAILED ??
    ../ext/POSIX/t/sysconf.t................FAILED 1-87
    ../ext/Storable/t/threads.t.............FAILED ??
    ../ext/Sys/Syslog/t/00-load.t...........FAILED 1
    ../ext/Sys/Syslog/t/constants.t.........FAILED 1-3 5 7 9 11
                                                   13 15 17 19 21
                                                   23 25 27 29 31
                                                   33 35 37 39 41
                                                   43 45 47 49 51
                                                   53 55 57 59 61
                                                   63 65 67 69 71
                                                   73 75 77 79 81
                                                   83 85 87
    ../ext/Sys/Syslog/t/syslog.t............FAILED 1 3-159
    ../ext/XS/APItest/t/my_cxt.t............FAILED ??
    ../ext/threads/shared/t/av_refs.t.......FAILED 2-14
    ../ext/threads/shared/t/av_simple.t.....FAILED 2-44
    ../ext/threads/shared/t/blessed.t.......FAILED 2-37
    ../ext/threads/shared/t/cond.t..........FAILED 2-82
    ../ext/threads/shared/t/hv_refs.t.......FAILED 2-20
    ../ext/threads/shared/t/hv_simple.t.....FAILED 2-16
    ../ext/threads/shared/t/no_share.t......FAILED 4-6
    ../ext/threads/shared/t/shared_attr.t...FAILED 2-101
    ../ext/threads/shared/t/sv_refs.t.......FAILED 2-11
    ../ext/threads/shared/t/sv_simple.t.....FAILED 2-11
    ../ext/threads/shared/t/wait.t..........FAILED 6-103
    ../ext/threads/t/basic.t................FAILED 3-33
    ../ext/threads/t/blocks.t...............FAILED 1-5
    ../ext/threads/t/context.t..............FAILED 1-31
    ../ext/threads/t/end.t..................FAILED 1-6
    ../ext/threads/t/err.t..................FAILED 2-10
    ../ext/threads/t/exit.t.................FAILED 2-18
    ../ext/threads/t/free.t.................FAILED 1-29
    ../ext/threads/t/free2.t................FAILED 1-78
    ../ext/threads/t/join.t.................FAILED 1-20
    ../ext/threads/t/kill.t.................FAILED ??
    ../ext/threads/t/libc.t.................FAILED 2-11
    ../ext/threads/t/list.t.................FAILED 3-15
    ../ext/threads/t/problems.t.............FAILED 2-15
    ../ext/threads/t/stack.t................FAILED 5-18
    ../ext/threads/t/state.t................FAILED 1-59
    ../ext/threads/t/stress_cv.t............FAILED 3-63
    ../ext/threads/t/stress_re.t............FAILED 2-31
    ../ext/threads/t/stress_string.t........FAILED 3-63
    ../ext/threads/t/thread.t...............FAILED 2-31
    ../lib/Locale/Codes/t/all.t.............FAILED ??
    ../lib/Net/Ping/t/100_load.t............FAILED 1
    ../lib/Net/Ping/t/110_icmp_inst.t.......FAILED ??
    ../lib/Net/Ping/t/120_udp_inst.t........FAILED ??
    ../lib/Net/Ping/t/130_tcp_inst.t........FAILED ??
    ../lib/Net/Ping/t/140_stream_inst.t.....FAILED ??
    ../lib/Net/Ping/t/150_syn_inst.t........FAILED ??
    ../lib/Net/Ping/t/190_alarm.t...........FAILED ??
    ../lib/Net/Ping/t/500_ping_icmp.t.......FAILED ??
    ../lib/Net/Ping/t/510_ping_udp.t........FAILED ??
    ../lib/Net/t/ftp.t......................FAILED ??
    ../lib/Net/t/nntp.t.....................FAILED ??
    ../lib/Net/t/require.t..................FAILED 5-9
    ../lib/Net/t/smtp.t.....................FAILED ??
    ../lib/Test/Simple/t/diag.t.............FAILED ??
    ../lib/Test/Simple/t/overload_threads.t.FAILED ??
    ../lib/Test/Simple/t/sort_bug.t.........FAILED ??
    ../lib/Test/Simple/t/threads.t..........FAILED ??
    ../lib/Thread/Queue.t...................FAILED ??
    ../t/io/dup.t...........................FAILED 15-26
    ../t/io/open.t..........................FAILED 93
    ../t/lib/1_compile.t....................FAILED 3
    ../t/lib/proxy_constant_subs.t..........FAILED 5-8
    ../t/op/getpid.t........................FAILED ??
    ../t/op/taint.t.........................FAILED ??
    ../t/op/threads.t.......................FAILED 1-6
Inconsistent test results (between TEST and harness):
    ../ext/IO/Compress/Zlib/t/105oneshot-deflate.tFAILED--expected 970 tests, saw 173
    ../ext/IO/Compress/Zlib/t/100generic-rawdeflate.tFAILED--expected 641 tests, saw 81
    ../ext/IO/Compress/Zlib/t/105oneshot-zip.tFAILED--expected 970 tests, saw 173
    ../ext/IO/Compress/Zlib/t/105oneshot-gzip.tFAILED--expected 970 tests, saw 173
    ../ext/IO/Compress/Zlib/t/105oneshot-rawdeflate.tFAILED--expected 970 tests, saw 173
    ../ext/IO/Compress/Zlib/t/100generic-zip.tFAILED--expected 641 tests, saw 81
    ../ext/IO/Compress/Zlib/t/100generic-gzip.tFAILED--expected 641 tests, saw 81
    ../ext/IO/Compress/Zlib/t/100generic-deflate.tFAILED--expected 641 tests, saw 81

[perlio] -DDEBUGGING -Duseithreads -Duselongdouble
[perlio] -DDEBUGGING -Duseithreads -Dusemorebits
    ../ext/B/t/concise-xs.t.................FAILED 812-1594
    ../ext/DB_File/t/db-btree.t.............FAILED ??
    ../ext/DB_File/t/db-hash.t..............FAILED ??
    ../ext/DB_File/t/db-recno.t.............FAILED ??
    ../ext/IO/t/IO.t........................FAILED 5-18
    ../ext/IO/t/io_multihomed.t.............FAILED ??
    ../ext/IO/t/io_sock.t...................FAILED ??
    ../ext/IO/t/io_udp.t....................FAILED ??
    ../ext/IO/t/io_unix.t...................FAILED ??
    ../ext/IO/t/io_xs.t.....................FAILED ??
    ../ext/NDBM_File/t/ndbm.t...............FAILED ??
    ../ext/POSIX/t/posix.t..................FAILED ??
    ../ext/POSIX/t/sysconf.t................FAILED 1-87
    ../ext/Storable/t/threads.t.............FAILED ??
    ../ext/Sys/Syslog/t/00-load.t...........FAILED 1
    ../ext/Sys/Syslog/t/constants.t.........FAILED 1-3 5 7 9 11 13
                                                   15 17 19 21 23
                                                   25 27 29 31 33
                                                   35 37 39 41 43
                                                   45 47 49 51 53
                                                   55 57 59 61 63
                                                   65 67 69 71 73
                                                   75 77 79 81 83
                                                   85 87
    ../ext/Sys/Syslog/t/syslog.t............FAILED 1 3-159
    ../ext/XS/APItest/t/my_cxt.t............FAILED ??
    ../ext/threads/shared/t/av_refs.t.......FAILED 2-14
    ../ext/threads/shared/t/av_simple.t.....FAILED 2-44
    ../ext/threads/shared/t/blessed.t.......FAILED 2-37
    ../ext/threads/shared/t/cond.t..........FAILED 2-82
    ../ext/threads/shared/t/hv_refs.t.......FAILED 2-20
    ../ext/threads/shared/t/hv_simple.t.....FAILED 2-16
    ../ext/threads/shared/t/shared_attr.t...FAILED 2-101
    ../ext/threads/shared/t/sv_refs.t.......FAILED 2-11
    ../ext/threads/shared/t/sv_simple.t.....FAILED 2-11
    ../ext/threads/shared/t/wait.t..........FAILED 6-103
    ../ext/threads/t/blocks.t...............FAILED 1-5
    ../ext/threads/t/context.t..............FAILED 1-31
    ../ext/threads/t/end.t..................FAILED 1-6
    ../ext/threads/t/exit.t.................FAILED 9-18
    ../ext/threads/t/free.t.................FAILED 1-29
    ../ext/threads/t/free2.t................FAILED 1-78
    ../ext/threads/t/join.t.................FAILED 1-20
    ../ext/threads/t/kill.t.................FAILED 1-19
    ../ext/threads/t/problems.t.............FAILED 2-15
    ../ext/threads/t/state.t................FAILED 1-59
    ../ext/threads/t/thread.t...............FAILED 4-31
    ../lib/Locale/Codes/t/all.t.............FAILED ??
    ../lib/Net/Ping/t/100_load.t............FAILED 1
    ../lib/Net/Ping/t/110_icmp_inst.t.......FAILED ??
    ../lib/Net/Ping/t/120_udp_inst.t........FAILED ??
    ../lib/Net/Ping/t/130_tcp_inst.t........FAILED ??
    ../lib/Net/Ping/t/140_stream_inst.t.....FAILED ??
    ../lib/Net/Ping/t/150_syn_inst.t........FAILED ??
    ../lib/Net/Ping/t/190_alarm.t...........FAILED ??
    ../lib/Net/Ping/t/500_ping_icmp.t.......FAILED ??
    ../lib/Net/Ping/t/510_ping_udp.t........FAILED ??
    ../lib/Net/t/ftp.t......................FAILED ??
    ../lib/Net/t/nntp.t.....................FAILED ??
    ../lib/Net/t/require.t..................FAILED 5-9
    ../lib/Net/t/smtp.t.....................FAILED ??
    ../lib/Test/Simple/t/diag.t.............FAILED ??
    ../lib/Test/Simple/t/overload_threads.t.FAILED ??
    ../lib/Test/Simple/t/sort_bug.t.........FAILED ??
    ../lib/Test/Simple/t/threads.t..........FAILED ??
    ../lib/Thread/Queue.t...................FAILED ??
    ../t/lib/1_compile.t....................FAILED 3
    ../t/lib/proxy_constant_subs.t..........FAILED 5-8
    ../t/op/getpid.t........................FAILED ??
    ../t/op/taint.t.........................FAILED ??

[stdio] -Duseithreads -Dusemorebits
    ../ext/Compress/Zlib/t/14gzopen.t.......FAILED 139-217
    ../ext/Hash/Util/FieldHash/t/03_class.t.FAILED 3-7
    ../ext/Hash/Util/FieldHash/t/04_thread.tFAILED 7-30
    ../ext/IO/t/io_pipe.t...................FAILED 9-10
    ../ext/POSIX/t/posix.t..................FAILED 11-66
    ../ext/POSIX/t/sigaction.t..............FAILED 25-31
    ../ext/Socket/t/socketpair.t............FAILED 36-45
    ../ext/Storable/t/threads.t.............FAILED ??
    ../ext/Time/HiRes/t/HiRes.t.............FAILED 12-38
    ../ext/XS/APItest/t/my_cxt.t............FAILED ??
    ../ext/threads/shared/t/av_refs.t.......FAILED 2-14
    ../ext/threads/shared/t/av_simple.t.....FAILED 2-44
    ../ext/threads/shared/t/blessed.t.......FAILED 2-37
    ../ext/threads/shared/t/cond.t..........FAILED 2-82
    ../ext/threads/shared/t/hv_refs.t.......FAILED 2-20
    ../ext/threads/shared/t/hv_simple.t.....FAILED 2-16
    ../ext/threads/shared/t/no_share.t......FAILED 4-6
    ../ext/threads/shared/t/shared_attr.t...FAILED 2-101
    ../ext/threads/shared/t/sv_refs.t.......FAILED 2-11
    ../ext/threads/shared/t/sv_simple.t.....FAILED 2-11
    ../ext/threads/shared/t/wait.t..........FAILED 6-103
    ../ext/threads/t/basic.t................FAILED 3-33
    ../ext/threads/t/blocks.t...............FAILED 1-5
    ../ext/threads/t/context.t..............FAILED 1-31
    ../ext/threads/t/end.t..................FAILED 1-6
    ../ext/threads/t/err.t..................FAILED 2-10
    ../ext/threads/t/exit.t.................FAILED 2-18
    ../ext/threads/t/free.t.................FAILED 1-29
    ../ext/threads/t/free2.t................FAILED 1-78
    ../ext/threads/t/join.t.................FAILED 1-20
    ../ext/threads/t/kill.t.................FAILED ??
    ../ext/threads/t/libc.t.................FAILED 2-11
    ../ext/threads/t/list.t.................FAILED 3-15
    ../ext/threads/t/problems.t.............FAILED 2-15
    ../ext/threads/t/stack.t................FAILED 5-18
    ../ext/threads/t/state.t................FAILED 1-59
    ../ext/threads/t/stress_cv.t............FAILED 3-63
    ../ext/threads/t/stress_re.t............FAILED 2-31
    ../ext/threads/t/stress_string.t........FAILED 3-63
    ../ext/threads/t/thread.t...............FAILED 2-31
    ../lib/Net/Ping/t/190_alarm.t...........FAILED 5-6
    ../lib/Test/Simple/t/diag.t.............FAILED ??
    ../lib/Test/Simple/t/overload_threads.t.FAILED ??
    ../lib/Test/Simple/t/sort_bug.t.........FAILED ??
    ../lib/Test/Simple/t/threads.t..........FAILED ??
    ../lib/Thread/Queue.t...................FAILED ??
    ../lib/warnings.t.......................FAILED 288
    ../t/io/dup.t...........................FAILED 15-26
    ../t/io/open.t..........................FAILED 93
    ../t/io/pipe.t..........................FAILED 9-24
    ../t/op/alarm.t.........................FAILED ??
    ../t/op/getpid.t........................FAILED ??
    ../t/op/magic.t.........................FAILED 3-5
    ../t/op/threads.t.......................FAILED 1-6
Inconsistent test results (between TEST and harness):
    ../ext/IO/Compress/Zlib/t/105oneshot-deflate.tFAILED--expected 970 tests, saw 173
    ../ext/IO/Compress/Zlib/t/100generic-rawdeflate.tFAILED--expected 641 tests, saw 81
    ../ext/IO/Compress/Zlib/t/105oneshot-zip.tFAILED--expected 970 tests, saw 173
    ../ext/IO/Compress/Zlib/t/105oneshot-gzip.tFAILED--expected 970 tests, saw 173
    ../ext/IO/Compress/Zlib/t/105oneshot-rawdeflate.tFAILED--expected 970 tests, saw 173
    ../ext/IO/Compress/Zlib/t/100generic-zip.tFAILED--expected 641 tests, saw 81
    ../ext/IO/Compress/Zlib/t/100generic-gzip.tFAILED--expected 641 tests, saw 81
    ../ext/IO/Compress/Zlib/t/100generic-deflate.tFAILED--expected 641 tests, saw 81

-- 
Report by Test::Smoke v1.19_83 build 980 running on perl 5.8.8
(Reporter v0.026 / Smoker v0.029)




nntp.perl.org: Perl Programming lists via nntp and http.
Comments to Ask Bjørn Hansen at ask@perl.org | Group listing | About