develooper Front page | perl.perl5.porters | Postings from March 2007

Smoke [5.8.8] 30522 FAIL(F) freebsd 6.0-STABLE (i386/6 cpu)

From:
david
Date:
March 10, 2007 23:35
Subject:
Smoke [5.8.8] 30522 FAIL(F) freebsd 6.0-STABLE (i386/6 cpu)
Message ID:
20070311073517.3318E2E020@profane.mongueurs.net
Automated smoke report for 5.8.8 patch 30522
profane.mongueurs.net: Intel Pentium III Xeon (i386/6 cpu)
    on        freebsd - 6.0-STABLE
    using     cc version 3.4.4 [FreeBSD] 20050518
    smoketime 1 day 16 minutes (average 30 minutes 21 seconds)

Summary: FAIL(F)

O = OK  F = Failure(s), extended report at the bottom
X = Failure(s) under TEST but not under harness
? = still running or test results not (yet) available
Build failures during:       - = unknown or N/A
c = Configure, m = make, M = make (after miniperl), t = make test-prep

   30522     Configuration (common) none
----------- ---------------------------------------------------------
F F F F     
F F F F     -DPERL_DONT_CREATE_GVSV
F F F F     -Dusemymalloc
F F F F     -Dusemymalloc -DPERL_DONT_CREATE_GVSV
F F F F     -Duse64bitint
F F F F     -Duse64bitint -DPERL_DONT_CREATE_GVSV
F F F F     -Duserelocatableinc
F F F F     -Duserelocatableinc -DPERL_DONT_CREATE_GVSV
F - F -     -Uuseperlio
F - F -     -Uuseperlio -DPERL_DONT_CREATE_GVSV
F - F -     -Uuseperlio -Dusemymalloc
F - F -     -Uuseperlio -Dusemymalloc -DPERL_DONT_CREATE_GVSV
F - F -     -Uuseperlio -Duse64bitint
F - F -     -Uuseperlio -Duse64bitint -DPERL_DONT_CREATE_GVSV
F - F -     -Uuseperlio -Duserelocatableinc
F - F -     -Uuseperlio -Duserelocatableinc -DPERL_DONT_CREATE_GVSV
F F F F     -Duseithreads
F F F F     -Duseithreads -DPERL_DONT_CREATE_GVSV
F F F F     -Duseithreads -Dusemymalloc
F F F F     -Duseithreads -Dusemymalloc -DPERL_DONT_CREATE_GVSV
F F F F     -Duseithreads -Duse64bitint
F F F F     -Duseithreads -Duse64bitint -DPERL_DONT_CREATE_GVSV
F F F F     -Duseithreads -Duserelocatableinc
F F F F     -Duseithreads -Duserelocatableinc -DPERL_DONT_CREATE_GVSV
| | | +----- PERLIO = perlio -DDEBUGGING
| | +------- PERLIO = stdio  -DDEBUGGING
| +--------- PERLIO = perlio
+----------- PERLIO = stdio

Locally applied patches:
    MAINT30141
    SMOKE30522

Failures: (common-args) none
[stdio/perlio] 
[stdio/perlio] -DDEBUGGING
[stdio/perlio] -DPERL_DONT_CREATE_GVSV
[stdio/perlio] -DDEBUGGING -DPERL_DONT_CREATE_GVSV
[stdio/perlio] -Dusemymalloc
[stdio/perlio] -DDEBUGGING -Dusemymalloc
[stdio/perlio] -Dusemymalloc -DPERL_DONT_CREATE_GVSV
[stdio/perlio] -DDEBUGGING -Dusemymalloc -DPERL_DONT_CREATE_GVSV
[stdio/perlio] -Duse64bitint
[stdio/perlio] -DDEBUGGING -Duse64bitint
[stdio/perlio] -Duse64bitint -DPERL_DONT_CREATE_GVSV
[stdio/perlio] -DDEBUGGING -Duse64bitint -DPERL_DONT_CREATE_GVSV
[stdio/perlio] -Duseithreads
[stdio/perlio] -DDEBUGGING -Duseithreads
[stdio/perlio] -Duseithreads -DPERL_DONT_CREATE_GVSV
[stdio/perlio] -DDEBUGGING -Duseithreads -DPERL_DONT_CREATE_GVSV
[stdio/perlio] -Duseithreads -Duse64bitint
[stdio/perlio] -DDEBUGGING -Duseithreads -Duse64bitint
[stdio/perlio] -Duseithreads -Duse64bitint -DPERL_DONT_CREATE_GVSV
[stdio/perlio] -DDEBUGGING -Duseithreads -Duse64bitint -DPERL_DONT_CREATE_GVSV
    ../t/io/dup.t...........................FAILED 15-16
    ../t/io/open.t..........................FAILED 93

[stdio/perlio] -Duserelocatableinc
[stdio/perlio] -DDEBUGGING -Duserelocatableinc
[stdio/perlio] -Duserelocatableinc -DPERL_DONT_CREATE_GVSV
[stdio/perlio] -DDEBUGGING -Duserelocatableinc -DPERL_DONT_CREATE_GVSV
    ../lib/ExtUtils/t/INST_PREFIX.t.........FAILED 19-25 27-29
    ../lib/ExtUtils/t/Installed.t...........FAILED 29-31 37 40
    ../t/io/dup.t...........................FAILED 15-16
    ../t/io/open.t..........................FAILED 93

[stdio] -Uuseperlio
[stdio] -DDEBUGGING -Uuseperlio
[stdio] -Uuseperlio -DPERL_DONT_CREATE_GVSV
[stdio] -DDEBUGGING -Uuseperlio -DPERL_DONT_CREATE_GVSV
[stdio] -Uuseperlio -Dusemymalloc
[stdio] -DDEBUGGING -Uuseperlio -Dusemymalloc
[stdio] -Uuseperlio -Dusemymalloc -DPERL_DONT_CREATE_GVSV
[stdio] -DDEBUGGING -Uuseperlio -Dusemymalloc -DPERL_DONT_CREATE_GVSV
[stdio] -Uuseperlio -Duse64bitint
[stdio] -DDEBUGGING -Uuseperlio -Duse64bitint
[stdio] -Uuseperlio -Duse64bitint -DPERL_DONT_CREATE_GVSV
[stdio] -DDEBUGGING -Uuseperlio -Duse64bitint -DPERL_DONT_CREATE_GVSV
    ../ext/PerlIO/encoding/t/nolooping.t....FAILED 1
    ../t/io/open.t..........................FAILED 93
    ../t/op/inccode-tie.t...................FAILED 46-48
    ../t/op/inccode.t.......................FAILED 46-48

[stdio] -Uuseperlio -Duserelocatableinc
[stdio] -DDEBUGGING -Uuseperlio -Duserelocatableinc
[stdio] -Uuseperlio -Duserelocatableinc -DPERL_DONT_CREATE_GVSV
[stdio] -DDEBUGGING -Uuseperlio -Duserelocatableinc -DPERL_DONT_CREATE_GVSV
    ../ext/PerlIO/encoding/t/nolooping.t....FAILED 1
    ../lib/ExtUtils/t/INST_PREFIX.t.........FAILED 19-25 27-29
    ../lib/ExtUtils/t/Installed.t...........FAILED 29-31 37 40
    ../t/io/open.t..........................FAILED 93
    ../t/op/inccode-tie.t...................FAILED 46-48
    ../t/op/inccode.t.......................FAILED 46-48

[stdio] -Duseithreads -Dusemymalloc
    ../ext/threads/shared/t/cond.t..........FAILED 33-82
    ../ext/threads/t/stress_re.t............FAILED 2-31
    ../lib/Thread/Queue.t...................FAILED 1-26
    ../t/io/dup.t...........................FAILED 15-16
    ../t/io/open.t..........................FAILED 93
Inconsistent test results (between TEST and harness):
    ../ext/threads/t/stress_string.t........FAILED--expected 63 tests, saw 11

[perlio] -Duseithreads -Dusemymalloc
    ../ext/threads/t/stress_re.t............FAILED 2-31
    ../t/io/dup.t...........................FAILED 15-16
    ../t/io/open.t..........................FAILED 93

[stdio] -DDEBUGGING -Duseithreads -Dusemymalloc
[stdio] -Duseithreads -Dusemymalloc -DPERL_DONT_CREATE_GVSV
[perlio] -DDEBUGGING -Duseithreads -Dusemymalloc -DPERL_DONT_CREATE_GVSV
    ../ext/threads/shared/t/cond.t..........FAILED 33-82
    ../ext/threads/t/stress_re.t............FAILED 2-31
    ../t/io/dup.t...........................FAILED 15-16
    ../t/io/open.t..........................FAILED 93
Inconsistent test results (between TEST and harness):
    ../ext/threads/t/thread.t...............FAILED--expected 31 tests, saw 24

[perlio] -DDEBUGGING -Duseithreads -Dusemymalloc
    ../ext/threads/shared/t/cond.t..........FAILED 33-82
    ../ext/threads/t/stress_re.t............FAILED 2-31
    ../t/io/dup.t...........................FAILED 15-16
    ../t/io/open.t..........................FAILED 93
Inconsistent test results (between TEST and harness):
    ../ext/threads/t/stress_string.t........FAILED--expected 63 tests, saw 4
    ../ext/threads/t/blocks.t...............FAILED--expected 5 tests, saw 1

[perlio] -Duseithreads -Dusemymalloc -DPERL_DONT_CREATE_GVSV
    ../ext/threads/shared/t/cond.t..........FAILED 33-82
    ../ext/threads/t/stress_re.t............FAILED 2-31
    ../t/io/dup.t...........................FAILED 15-16
    ../t/io/open.t..........................FAILED 93
Inconsistent test results (between TEST and harness):
    ../ext/threads/t/free.t.................FAILED--expected 29 tests, saw 5

[stdio] -DDEBUGGING -Duseithreads -Dusemymalloc -DPERL_DONT_CREATE_GVSV
    ../ext/threads/shared/t/cond.t..........FAILED 33-82
    ../ext/threads/t/free2.t................FAILED 3-78
    ../ext/threads/t/stress_re.t............FAILED 2-31
    ../ext/threads/t/stress_string.t........FAILED 29-63
    ../t/io/dup.t...........................FAILED 15-16
    ../t/io/open.t..........................FAILED 93

[stdio/perlio] -Duseithreads -Duserelocatableinc
[stdio/perlio] -DDEBUGGING -Duseithreads -Duserelocatableinc
[stdio/perlio] -Duseithreads -Duserelocatableinc -DPERL_DONT_CREATE_GVSV
[stdio/perlio] -DDEBUGGING -Duseithreads -Duserelocatableinc -DPERL_DONT_CREATE_GVSV
    ../lib/ExtUtils/t/INST_PREFIX.t.........FAILED 19-25 27-29
    ../lib/ExtUtils/t/Installed.t...........FAILED 29-31 37 40
    ../lib/Tie/RefHash/rebless.t............FAILED ??
    ../lib/Tie/RefHash/refhash.t............FAILED ??
    ../lib/Tie/RefHash/storable.t...........FAILED ??
    ../lib/Tie/RefHash/threaded.t...........FAILED 1-14
    ../t/io/dup.t...........................FAILED 15-16
    ../t/io/open.t..........................FAILED 93

Compiler messages(gcc):
toke.c: In function `Perl_lex_start':
toke.c:554: warning: 's' might be used uninitialized in this function
dump.c: In function `Perl_sv_peek':
dump.c:479: warning: signed and unsigned type in conditional expression
dump.c: In function `Perl_do_sv_dump':
dump.c:1303: warning: signed and unsigned type in conditional expression
mg.c: In function `Perl_magic_regdata_cnt':
mg.c:510: warning: suggest parentheses around && within ||
mg.c: In function `Perl_magic_setenv':
mg.c:1125: warning: unused variable `path_sep'
perl.c: In function `Perl_call_list':
perl.c:5256: warning: variable 'oldline' might be clobbered by `longjmp' or `vfork'
sv.c: In function `Perl_sv_force_normal_flags':
sv.c:3751: warning: signed and unsigned type in conditional expression
sv.c: In function `Perl_sv_clear':
sv.c:4668: warning: signed and unsigned type in conditional expression
pp_ctl.c: In function `Perl_pp_formline':
pp_ctl.c:779: warning: signed and unsigned type in conditional expression
proto.h:1812: warning: 'S_emulate_eaccess' declared `static' but never defined
doio.c: In function `Perl_do_shmio':
doio.c:2244: warning: comparison between signed and unsigned
doio.c:2244: warning: signed and unsigned type in conditional expression
regexec.c: In function `S_regcppop':
regexec.c:264: warning: comparison between signed and unsigned
numeric.c: In function `Perl_grok_numeric_radix':
numeric.c:504: warning: signed and unsigned type in conditional expression
numeric.c: In function `Perl_my_atof':
numeric.c:809: warning: signed and unsigned type in conditional expression
mathoms.c:1296: warning: unused parameter 'message'
mathoms.c:1296: warning: unused parameter 'msglen'
mathoms.c:1296: warning: unused parameter 'utf8'
sv.c: In function `Perl_sv_2nv':
sv.c:2305: warning: signed and unsigned type in conditional expression
sv.c:2430: warning: signed and unsigned type in conditional expression
regexec.c:246: warning: comparison between signed and unsigned
malloc.c: In function `Perl_malloc':
malloc.c:1532: warning: empty body in an else-statement
malloc.c: In function `Perl_mfree':
malloc.c:2066: warning: empty body in an else-statement
malloc.c:2074: warning: empty body in an else-statement
malloc.c:2080: warning: empty body in an else-statement
malloc.c:2082: warning: empty body in an else-statement
malloc.c:2089: warning: empty body in an else-statement
malloc.c: In function `Perl_realloc':
malloc.c:2219: warning: empty body in an else-statement
malloc.c:2224: warning: empty body in an else-statement
malloc.c:2226: warning: empty body in an else-statement
util.c: In function `Perl_get_hash_seed':
util.c:4733: warning: implicit declaration of function `strtoull'
mg.c: In function `Perl_magic_set':
mg.c:2584: warning: implicit declaration of function `atoll'
perlio.c:242: warning: unused parameter 'f'
perlio.c:242: warning: unused parameter 'mode'
perlio.c:264: warning: unused parameter 'names'
perlio.c:277: warning: unused parameter 'param'
perlio.c:277: warning: unused parameter 'flags'
perlio.c:318: warning: unused parameter 'layers'
sv.c:4667: warning: signed and unsigned type in conditional expression
perlio.c: In function `PerlIO_clone':
perlio.c:678: warning: ignoring return value of `Perl_fp_dup', declared with attribute warn_unused_result

-- 
Report by Test::Smoke v1.19_84 build 1008 running on perl 5.8.8
(Reporter v0.026 / Smoker v0.030)



nntp.perl.org: Perl Programming lists via nntp and http.
Comments to Ask Bjørn Hansen at ask@perl.org | Group listing | About