develooper Front page | perl.perl5.porters | Postings from September 2006

Smoke [5.9.4] 28907 FAIL(F) darwin 6.8 (Power Macintosh)

From:
steve
Date:
September 30, 2006 07:27
Subject:
Smoke [5.9.4] 28907 FAIL(F) darwin 6.8 (Power Macintosh)
Message ID:
200609301427.k8UERRol005287@adiminstrators-computer.local
Automated smoke report for 5.9.4 patch 28907
Adiminstrators-Computer.local.:  () (Power Macintosh)
    on        darwin - 6.8 (Mac OS X)
    using     cc version 3.1 20020420 (prerelease)
    smoketime 11 hours 56 minutes (average 1 hour 29 minutes)

Summary: FAIL(F)

O = OK  F = Failure(s), extended report at the bottom
X = Failure(s) under TEST but not under harness
? = still running or test results not (yet) available
Build failures during:       - = unknown or N/A
c = Configure, m = make, M = make (after miniperl), t = make test-prep

   28907     Configuration (common) none
----------- ---------------------------------------------------------
F F F F     
F F F F     -Duse64bitint
F F F F     -Duseithreads
F F F F     -Duseithreads -Duse64bitint
| | | +----- PERLIO = perlio -DDEBUGGING
| | +------- PERLIO = stdio  -DDEBUGGING
| +--------- PERLIO = perlio
+----------- PERLIO = stdio

Locally applied patches:
    SMOKE28907

Failures: (common-args) none
[stdio/perlio] 
[stdio/perlio] -Duse64bitint
[stdio/perlio] -Duseithreads
[stdio/perlio] -Duseithreads -Duse64bitint
    ../ext/DB_File/t/db-btree.t.............FAILED ??
    ../ext/DB_File/t/db-recno.t.............FAILED 70

[stdio] -DDEBUGGING
    ../ext/B/t/concise-xs.t.................FAILED 238-1588
    ../ext/B/t/deparse.t....................FAILED ??
    ../ext/B/t/f_map.t......................FAILED ??
    ../ext/B/t/f_sort.t.....................FAILED ??
    ../ext/B/t/o.t..........................FAILED ??
    ../ext/B/t/optree_check.t...............FAILED ??
    ../ext/B/t/optree_concise.t.............FAILED ??
    ../ext/B/t/optree_constants.t...........FAILED ??
    ../ext/B/t/optree_misc.t................FAILED ??
    ../ext/B/t/optree_samples.t.............FAILED ??
    ../ext/B/t/optree_sort.t................FAILED ??
    ../ext/B/t/optree_specials.t............FAILED ??
    ../ext/B/t/optree_varinit.t.............FAILED ??
    ../ext/Compress/IO/Base/t/01misc.t......FAILED ??
    ../ext/Compress/IO/Base/t/globmapper.t..FAILED ??
    ../ext/Compress/IO/Zlib/t/002any-gzip.t.FAILED ??
    ../ext/Compress/IO/Zlib/t/002any-zip.t..FAILED ??
    ../ext/Compress/IO/Zlib/t/004gziphdr.t..FAILED ??
    ../ext/Compress/IO/Zlib/t/005defhdr.t...FAILED ??
    ../ext/Compress/IO/Zlib/t/010examples.t.FAILED ??
    ../ext/Compress/IO/Zlib/t/020isize.t....FAILED ??
    ../ext/Compress/IO/Zlib/t/102tied-gzip.tFAILED ??
    ../ext/Compress/IO/Zlib/t/102tied-zip.t.FAILED ??
    ../ext/Compress/IO/Zlib/t/106prime-gzip.tFAILED ??
    ../ext/Compress/IO/Zlib/t/106prime-zip.tFAILED ??
    ../ext/Compress/IO/Zlib/t/107multi-gzip.tFAILED ??
    ../ext/Compress/IO/Zlib/t/107multi-zip.tFAILED ??
    ../ext/Compress/IO/Zlib/t/108anyunc-zip.tFAILED ??
    ../ext/Compress/IO/Zlib/t/109merge-gzip.tFAILED ??
    ../ext/Compress/Raw/Zlib/t/02zlib.t.....FAILED ??
    ../ext/Compress/Raw/Zlib/t/07bufsize.t..FAILED ??
    ../ext/Compress/Raw/Zlib/t/18lvalue.t...FAILED ??
    ../ext/Compress/Zlib/t/03zlib-v1.t......FAILED ??
    ../ext/Compress/Zlib/t/05examples.t.....FAILED ??
    ../ext/Compress/Zlib/t/06gzsetp.t.......FAILED ??
    ../ext/Compress/Zlib/t/08encoding.t.....FAILED ??
    ../ext/Compress/Zlib/t/14gzopen.t.......FAILED ??
    ../ext/Cwd/t/cwd.t......................FAILED ??
    ../ext/DB_File/t/db-btree.t.............FAILED ??
    ../ext/DB_File/t/db-recno.t.............FAILED 70
    ../ext/Data/Dumper/t/dumper.t...........FAILED ??
    ../ext/Devel/PPPort/t/ppphtest.t........FAILED 1-203
    ../ext/Digest/SHA/t/2-nist-sha-oo.t.....FAILED ??
    ../ext/Digest/SHA/t/2-nist-vectors-bit.tFAILED ??
    ../ext/Digest/SHA/t/2-nist-vectors-byte.tFAILED ??
    ../ext/Digest/SHA/t/3-gillogly-hard.t...FAILED ??
    ../ext/Digest/SHA/t/6-dump-load.t.......FAILED ??
    ../ext/Digest/SHA/t/7-ireland.t.........FAILED ??
    ../ext/Encode/t/CJKT.t..................FAILED 1-60
    ../ext/Encode/t/Unicode.t...............FAILED 1-37
    ../ext/Encode/t/enc_module.t............FAILED 1-3
    ../ext/Encode/t/guess.t.................FAILED ??
    ../ext/Encode/t/perlio.t................FAILED ??
    ../ext/IO/t/IO.t........................FAILED ??
    ../ext/Storable/t/code.t................FAILED ??
    ../ext/Storable/t/just_plain_nasty.t....FAILED ??
    ../ext/Sys/Syslog/t/00-load.t...........FAILED 1
    ../ext/Sys/Syslog/t/constants.t.........FAILED 1-88
    ../ext/Sys/Syslog/t/syslog.t............FAILED 1-159
    ../ext/re/t/re.t........................FAILED 1-13
    ../ext/re/t/regop.t.....................FAILED 19-46
    ../lib/Archive/Tar/t/01_use.t...........FAILED 1-2
    ../lib/Archive/Tar/t/02_methods.t.......FAILED ??
    ../lib/Archive/Tar/t/03_file.t..........FAILED ??
    ../lib/Archive/Tar/t/04_resolved_issues.tFAILED ??
    ../lib/AutoLoader.t.....................FAILED ??
    ../lib/AutoSplit.t......................FAILED 1-58
    ../lib/CPAN/t/01loadme.t................FAILED ??
    ../lib/CPAN/t/02nox.t...................FAILED 1-8
    ../lib/CPAN/t/03pkgs.t..................FAILED 1-6
    ../lib/CPAN/t/11mirroredby.t............FAILED 1-6
    ../lib/ExtUtils/CBuilder/t/01-basic.t...FAILED 1-11
    ../lib/ExtUtils/CBuilder/t/02-link.t....FAILED 1-5
    ../lib/ExtUtils/ParseXS/t/basic.t.......FAILED 1-10
    ../lib/ExtUtils/t/00compile.t...........FAILED ??
    ../lib/ExtUtils/t/Command.t.............FAILED ??
    ../lib/ExtUtils/t/Constant.t............FAILED ??
    ../lib/ExtUtils/t/Embed.t...............FAILED 1-9
    ../lib/ExtUtils/t/FIRST_MAKEFILE.t......FAILED 1-7
    ../lib/ExtUtils/t/INST.t................FAILED 1-26
    ../lib/ExtUtils/t/INSTALL_BASE.t........FAILED ??
    ../lib/ExtUtils/t/INST_PREFIX.t.........FAILED 1-52
    ../lib/ExtUtils/t/Install.t.............FAILED ??
    ../lib/ExtUtils/t/Installed.t...........FAILED ??
    ../lib/ExtUtils/t/Liblist.t.............FAILED 1-6
    ../lib/ExtUtils/t/MM_Any.t..............FAILED 1-7
    ../lib/ExtUtils/t/MM_OS2.t..............FAILED ??
    ../lib/ExtUtils/t/MM_Unix.t.............FAILED 1-110
    ../lib/ExtUtils/t/Manifest.t............FAILED 1-49
    ../lib/ExtUtils/t/PL_FILES.t............FAILED 1-9
    ../lib/ExtUtils/t/VERSION_FROM.t........FAILED 1
    ../lib/ExtUtils/t/backwards.t...........FAILED 1-2
    ../lib/ExtUtils/t/basic.t...............FAILED 1-80
    ../lib/ExtUtils/t/build_man.t...........FAILED 1-9
    ../lib/ExtUtils/t/dir_target.t..........FAILED 1
    ../lib/ExtUtils/t/hints.t...............FAILED 1-3
    ../lib/ExtUtils/t/make.t................FAILED 1-3
    ../lib/ExtUtils/t/oneliner.t............FAILED 1-6
    ../lib/ExtUtils/t/parse_version.t.......FAILED 1-10
    ../lib/ExtUtils/t/pm.t..................FAILED 1-6
    ../lib/ExtUtils/t/postamble.t...........FAILED 1-8
    ../lib/ExtUtils/t/prefixify.t...........FAILED ??
    ../lib/ExtUtils/t/prereq_print.t........FAILED ??
    ../lib/ExtUtils/t/problems.t............FAILED 1-6
    ../lib/ExtUtils/t/prompt.t..............FAILED 1-11
    ../lib/ExtUtils/t/recurs.t..............FAILED 1-25
    ../lib/ExtUtils/t/revision.t............FAILED 1-4
    ../lib/ExtUtils/t/split_command.t.......FAILED ??
    ../lib/ExtUtils/t/writemakefile_args.t..FAILED 1-16
    ../lib/ExtUtils/t/xs.t..................FAILED ??
    ../lib/File/Basename.t..................FAILED 1-64
    ../lib/File/Compare.t...................FAILED ??
    ../lib/File/Copy.t......................FAILED 21-60
    ../lib/File/Find/t/find.t...............FAILED ??
    ../lib/File/Find/t/taint.t..............FAILED 1-45
    ../lib/File/Path.t......................FAILED ??
    ../lib/File/Spec/t/Spec.t...............FAILED ??
    ../lib/File/Spec/t/crossplatform.t......FAILED 37-50
    ../lib/File/Temp/t/mktemp.t.............FAILED 1-9
    ../lib/File/Temp/t/object.t.............FAILED 1-26
    ../lib/File/Temp/t/posix.t..............FAILED 1-7
    ../lib/File/Temp/t/security.t...........FAILED 1-13
    ../lib/File/Temp/t/seekable.t...........FAILED 1-7
    ../lib/File/Temp/t/tempfile.t...........FAILED 1-22
    ../lib/FindBin.t........................FAILED ??
    ../lib/Module/Build/t/basic.t...........FAILED 1-55
    ../lib/Module/Build/t/compat.t..........FAILED ??
    ../lib/Module/Build/t/destinations.t....FAILED 1-113
    ../lib/Module/Build/t/ext.t.............FAILED ??
    ../lib/Module/Build/t/extend.t..........FAILED 1-64
    ../lib/Module/Build/t/files.t...........FAILED 1-6
    ../lib/Module/Build/t/install.t.........FAILED 1-34
    ../lib/Module/Build/t/manifypods.t......FAILED ??
    ../lib/Module/Build/t/metadata.t........FAILED 1-43
    ../lib/Module/Build/t/metadata2.t.......FAILED 1-18
    ../lib/Module/Build/t/moduleinfo.t......FAILED 1-75
    ../lib/Module/Build/t/notes.t...........FAILED 1-11
    ../lib/Module/Build/t/parents.t.........FAILED 1-27
    ../lib/Module/Build/t/ppm.t.............FAILED ??
    ../lib/Module/Build/t/runthrough.t......FAILED 1-32
    ../lib/Module/Build/t/signature.t.......FAILED ??
    ../lib/Module/Build/t/tilde.t...........FAILED 1-11
    ../lib/Module/Build/t/versions.t........FAILED 1-2
    ../lib/Module/Build/t/xs.t..............FAILED ??
    ../lib/Pod/Perldoc/t/checkerbasic.t.....FAILED 2
    ../lib/Pod/Simple/t/00about.t...........FAILED 5-27
    ../lib/Pod/Simple/t/htmlbatch_01.t......FAILED 1-8
    ../lib/Pod/Simple/t/render.t............FAILED 1-26
    ../lib/Pod/Simple/t/search_05sane.t.....FAILED ??
    ../lib/Pod/Simple/t/search_12survey_cwd.tFAILED ??
    ../lib/Pod/Simple/t/search_20survey_two.tFAILED ??
    ../lib/Pod/Simple/t/search_50survey_inc.tFAILED ??
    ../lib/Pod/t/Functions.t................FAILED ??
    ../lib/Pod/t/Usage.t....................FAILED ??
    ../lib/Pod/t/basic.t....................FAILED 3-11
    ../lib/Pod/t/contains_pod.t.............FAILED 1
    ../lib/Pod/t/filehandle.t...............FAILED 2-3
    ../lib/Pod/t/man.t......................FAILED 2-21
    ../lib/Pod/t/pod-parser.t...............FAILED 2-3
    ../lib/Text/TabsWrap/t/37000.t..........FAILED ??
    ../lib/Text/TabsWrap/t/39548.t..........FAILED ??
    ../lib/Text/TabsWrap/t/Jochen.t.........FAILED ??
    ../lib/Text/TabsWrap/t/belg4mit.t.......FAILED ??
    ../lib/Text/TabsWrap/t/fill.t...........FAILED ??
    ../lib/Text/TabsWrap/t/sep.t............FAILED ??
    ../lib/Text/TabsWrap/t/sep2.t...........FAILED ??
    ../lib/Text/TabsWrap/t/wrap.t...........FAILED ??
    ../lib/feature.t........................FAILED ??
    ../lib/h2ph.t...........................FAILED 1-2
    ../lib/h2xs.t...........................FAILED ??
    ../lib/lib.t............................FAILED 1-13
    ../lib/warnings.t.......................FAILED ??
    ../t/op/mkdir.t.........................FAILED ??
    ../t/op/pat.t...........................FAILED ??
    ../t/op/taint.t.........................FAILED ??
    ../t/pod/emptycmd.t.....................FAILED ??
    ../t/pod/find.t.........................FAILED 1-4
    ../t/pod/for.t..........................FAILED ??
    ../t/pod/headings.t.....................FAILED ??
    ../t/pod/include.t......................FAILED ??
    ../t/pod/included.t.....................FAILED ??
    ../t/pod/lref.t.........................FAILED ??
    ../t/pod/multiline_items.t..............FAILED ??
    ../t/pod/nested_items.t.................FAILED ??
    ../t/pod/nested_seqs.t..................FAILED ??
    ../t/pod/oneline_cmds.t.................FAILED ??
    ../t/pod/pod2usage.t....................FAILED ??
    ../t/pod/poderrs.t......................FAILED ??
    ../t/pod/podselect.t....................FAILED ??
    ../t/pod/special_seqs.t.................FAILED ??
Inconsistent test results (between TEST and harness):
    ../ext/Compress/IO/Zlib/t/108anyunc-gzip.tFAILED--no leader found
    ../lib/Pod/Simple/t/search_25_glob_squaa.tFAILED--no leader found
    ../ext/Compress/IO/Zlib/t/106prime-rawdeflate.tFAILED--no leader found
    ../lib/Pod/Simple/t/search_26_glob_kleene_k.tFAILED--no leader found
    ../ext/Compress/IO/Zlib/t/107multi-deflate.tFAILED--no leader found
    ../ext/Compress/IO/Zlib/t/050interop-gzip.tFAILED--no leader found
    ../ext/Compress/IO/Zlib/t/101truncate-rawdeflate.tFAILED--expected 625 tests, saw 0
    ../ext/Compress/IO/Zlib/t/105oneshot-zip-only.tFAILED--no leader found
    ../ext/Compress/IO/Zlib/t/102tied-deflate.tFAILED--no leader found
    ../ext/Compress/IO/Zlib/t/001zlib-generic-zip.tFAILED--no leader found
    ../ext/Compress/IO/Zlib/t/002any-transparent.tFAILED--no leader found
    ../ext/Compress/IO/Zlib/t/106prime-deflate.tFAILED--no leader found
    ../ext/Compress/IO/Zlib/t/105oneshot-rawdeflate.tFAILED--no leader found
    ../ext/Compress/IO/Zlib/t/002any-rawdeflate.tFAILED--no leader found
    ../ext/Compress/IO/Zlib/t/108anyunc-rawdeflate.tFAILED--no leader found
    ../ext/Compress/IO/Zlib/t/108anyunc-deflate.tFAILED--no leader found
    ../ext/Compress/IO/Zlib/t/103newtied-deflate.tFAILED--no leader found
    ../ext/Compress/IO/Zlib/t/105oneshot-gzip.tFAILED--no leader found
    ../ext/Compress/IO/Zlib/t/103newtied-zip.tFAILED--no leader found
    ../ext/Compress/IO/Zlib/t/104destroy-rawdeflate.tFAILED--no leader found
    ../ext/Compress/IO/Zlib/t/103newtied-gzip.tFAILED--no leader found
    ../ext/Compress/IO/Zlib/t/107multi-rawdeflate.tFAILED--no leader found
    ../lib/Pod/Simple/t/search_27_glob_squaa_kleene.tFAILED--no leader found
    ../lib/Pod/Simple/t/search_29_glob_z_qmark_k.tFAILED--no leader found
    ../ext/Compress/IO/Zlib/t/001zlib-generic-gzip.tFAILED--no leader found
    ../ext/Compress/IO/Zlib/t/002any-deflate.tFAILED--no leader found
    ../ext/Compress/IO/Zlib/t/105oneshot-deflate.tFAILED--no leader found
    ../lib/Pod/Simple/t/search_28_glob_z_kleene_k.tFAILED--no leader found
    ../ext/Compress/IO/Zlib/t/109merge-rawdeflate.tFAILED--no leader found
    ../ext/Compress/IO/Zlib/t/101truncate-deflate.tFAILED--expected 734 tests, saw 0
    ../ext/Compress/IO/Zlib/t/100generic-zip.tFAILED--no leader found
    ../ext/Compress/IO/Zlib/t/108anyunc-transparent.tFAILED--no leader found
    ../ext/Compress/IO/Zlib/t/104destroy-deflate.tFAILED--no leader found
    ../ext/Compress/IO/Zlib/t/104destroy-gzip.tFAILED--no leader found
    ../ext/Compress/IO/Zlib/t/001zlib-generic-rawdeflate.tFAILED--no leader found
    ../ext/Compress/IO/Zlib/t/100generic-deflate.tFAILED--no leader found
    ../ext/Compress/IO/Zlib/t/103newtied-rawdeflate.tFAILED--no leader found
    ../ext/Compress/IO/Zlib/t/105oneshot-zip.tFAILED--no leader found
    ../ext/Compress/IO/Zlib/t/109merge-deflate.tFAILED--no leader found
    ../ext/Compress/IO/Zlib/t/101truncate-zip.tFAILED--expected 2316 tests, saw 0
    ../ext/Compress/IO/Zlib/t/101truncate-gzip.tFAILED--expected 978 tests, saw 0
    ../ext/Compress/IO/Zlib/t/105oneshot-gzip-only.tFAILED--no leader found
    ../lib/Pod/Simple/t/search_10survey_specific.tFAILED--no leader found
    ../ext/Compress/IO/Zlib/t/102tied-rawdeflate.tFAILED--no leader found
    ../ext/Compress/IO/Zlib/t/001zlib-generic-deflate.tFAILED--no leader found
    ../lib/Pod/Simple/t/search_22survey_two_shadowing.tFAILED--no leader found
    ../ext/Compress/IO/Zlib/t/104destroy-zip.tFAILED--no leader found
    ../ext/Compress/IO/Zlib/t/100generic-gzip.tFAILED--no leader found
    ../ext/Compress/IO/Zlib/t/100generic-rawdeflate.tFAILED--no leader found

[perlio] -DDEBUGGING
[stdio/perlio] -DDEBUGGING -Duse64bitint
[stdio/perlio] -DDEBUGGING -Duseithreads
[stdio/perlio] -DDEBUGGING -Duseithreads -Duse64bitint
    ../ext/B/t/concise-xs.t.................FAILED 238-1588
    ../ext/B/t/deparse.t....................FAILED ??
    ../ext/B/t/f_map.t......................FAILED ??
    ../ext/B/t/f_sort.t.....................FAILED ??
    ../ext/B/t/o.t..........................FAILED ??
    ../ext/B/t/optree_check.t...............FAILED ??
    ../ext/B/t/optree_concise.t.............FAILED ??
    ../ext/B/t/optree_constants.t...........FAILED ??
    ../ext/B/t/optree_misc.t................FAILED ??
    ../ext/B/t/optree_samples.t.............FAILED ??
    ../ext/B/t/optree_sort.t................FAILED ??
    ../ext/B/t/optree_specials.t............FAILED ??
    ../ext/B/t/optree_varinit.t.............FAILED ??
    ../ext/Compress/IO/Base/t/01misc.t......FAILED ??
    ../ext/Compress/IO/Base/t/globmapper.t..FAILED ??
    ../ext/Compress/IO/Zlib/t/002any-gzip.t.FAILED ??
    ../ext/Compress/IO/Zlib/t/002any-zip.t..FAILED ??
    ../ext/Compress/IO/Zlib/t/004gziphdr.t..FAILED ??
    ../ext/Compress/IO/Zlib/t/005defhdr.t...FAILED ??
    ../ext/Compress/IO/Zlib/t/010examples.t.FAILED ??
    ../ext/Compress/IO/Zlib/t/020isize.t....FAILED ??
    ../ext/Compress/IO/Zlib/t/102tied-gzip.tFAILED ??
    ../ext/Compress/IO/Zlib/t/102tied-zip.t.FAILED ??
    ../ext/Compress/IO/Zlib/t/106prime-gzip.tFAILED ??
    ../ext/Compress/IO/Zlib/t/106prime-zip.tFAILED ??
    ../ext/Compress/IO/Zlib/t/107multi-gzip.tFAILED ??
    ../ext/Compress/IO/Zlib/t/107multi-zip.tFAILED ??
    ../ext/Compress/IO/Zlib/t/108anyunc-zip.tFAILED ??
    ../ext/Compress/IO/Zlib/t/109merge-gzip.tFAILED ??
    ../ext/Compress/Raw/Zlib/t/02zlib.t.....FAILED ??
    ../ext/Compress/Raw/Zlib/t/07bufsize.t..FAILED ??
    ../ext/Compress/Raw/Zlib/t/18lvalue.t...FAILED ??
    ../ext/Compress/Zlib/t/03zlib-v1.t......FAILED ??
    ../ext/Compress/Zlib/t/05examples.t.....FAILED ??
    ../ext/Compress/Zlib/t/06gzsetp.t.......FAILED ??
    ../ext/Compress/Zlib/t/08encoding.t.....FAILED ??
    ../ext/Compress/Zlib/t/14gzopen.t.......FAILED ??
    ../ext/Cwd/t/cwd.t......................FAILED ??
    ../ext/DB_File/t/db-btree.t.............FAILED ??
    ../ext/DB_File/t/db-recno.t.............FAILED 70
    ../ext/Data/Dumper/t/dumper.t...........FAILED ??
    ../ext/Devel/PPPort/t/ppphtest.t........FAILED 1-203
    ../ext/Digest/SHA/t/2-nist-sha-oo.t.....FAILED ??
    ../ext/Digest/SHA/t/2-nist-vectors-bit.tFAILED ??
    ../ext/Digest/SHA/t/2-nist-vectors-byte.tFAILED ??
    ../ext/Digest/SHA/t/3-gillogly-hard.t...FAILED ??
    ../ext/Digest/SHA/t/6-dump-load.t.......FAILED ??
    ../ext/Digest/SHA/t/7-ireland.t.........FAILED ??
    ../ext/Encode/t/CJKT.t..................FAILED 1-60
    ../ext/Encode/t/Unicode.t...............FAILED 1-37
    ../ext/Encode/t/enc_module.t............FAILED 1-3
    ../ext/Encode/t/guess.t.................FAILED ??
    ../ext/Encode/t/perlio.t................FAILED ??
    ../ext/IO/t/IO.t........................FAILED ??
    ../ext/Storable/t/code.t................FAILED ??
    ../ext/Storable/t/just_plain_nasty.t....FAILED ??
    ../ext/Sys/Syslog/t/00-load.t...........FAILED 1
    ../ext/Sys/Syslog/t/constants.t.........FAILED 1-88
    ../ext/Sys/Syslog/t/syslog.t............FAILED 1-159
    ../ext/re/t/re.t........................FAILED 1-13
    ../ext/re/t/regop.t.....................FAILED 19-46
    ../lib/Archive/Tar/t/01_use.t...........FAILED 1-2
    ../lib/Archive/Tar/t/02_methods.t.......FAILED ??
    ../lib/Archive/Tar/t/03_file.t..........FAILED ??
    ../lib/Archive/Tar/t/04_resolved_issues.tFAILED ??
    ../lib/AutoLoader.t.....................FAILED ??
    ../lib/AutoSplit.t......................FAILED 1-58
    ../lib/CPAN/t/01loadme.t................FAILED ??
    ../lib/CPAN/t/02nox.t...................FAILED 1-8
    ../lib/CPAN/t/03pkgs.t..................FAILED 1-6
    ../lib/CPAN/t/11mirroredby.t............FAILED 1-6
    ../lib/ExtUtils/CBuilder/t/01-basic.t...FAILED 1-11
    ../lib/ExtUtils/CBuilder/t/02-link.t....FAILED 1-5
    ../lib/ExtUtils/ParseXS/t/basic.t.......FAILED 1-10
    ../lib/ExtUtils/t/00compile.t...........FAILED ??
    ../lib/ExtUtils/t/Command.t.............FAILED ??
    ../lib/ExtUtils/t/Constant.t............FAILED ??
    ../lib/ExtUtils/t/Embed.t...............FAILED 1-9
    ../lib/ExtUtils/t/FIRST_MAKEFILE.t......FAILED 1-7
    ../lib/ExtUtils/t/INST.t................FAILED 1-26
    ../lib/ExtUtils/t/INSTALL_BASE.t........FAILED ??
    ../lib/ExtUtils/t/INST_PREFIX.t.........FAILED 1-52
    ../lib/ExtUtils/t/Install.t.............FAILED ??
    ../lib/ExtUtils/t/Installed.t...........FAILED ??
    ../lib/ExtUtils/t/Liblist.t.............FAILED 1-6
    ../lib/ExtUtils/t/MM_Any.t..............FAILED 1-7
    ../lib/ExtUtils/t/MM_OS2.t..............FAILED ??
    ../lib/ExtUtils/t/MM_Unix.t.............FAILED 1-110
    ../lib/ExtUtils/t/Manifest.t............FAILED 1-49
    ../lib/ExtUtils/t/PL_FILES.t............FAILED 1-9
    ../lib/ExtUtils/t/VERSION_FROM.t........FAILED 1
    ../lib/ExtUtils/t/backwards.t...........FAILED 1-2
    ../lib/ExtUtils/t/basic.t...............FAILED 1-80
    ../lib/ExtUtils/t/build_man.t...........FAILED 1-9
    ../lib/ExtUtils/t/dir_target.t..........FAILED 1
    ../lib/ExtUtils/t/hints.t...............FAILED 1-3
    ../lib/ExtUtils/t/make.t................FAILED 1-3
    ../lib/ExtUtils/t/oneliner.t............FAILED 1-6
    ../lib/ExtUtils/t/parse_version.t.......FAILED 1-10
    ../lib/ExtUtils/t/pm.t..................FAILED 1-6
    ../lib/ExtUtils/t/postamble.t...........FAILED 1-8
    ../lib/ExtUtils/t/prefixify.t...........FAILED ??
    ../lib/ExtUtils/t/prereq_print.t........FAILED ??
    ../lib/ExtUtils/t/problems.t............FAILED 1-6
    ../lib/ExtUtils/t/prompt.t..............FAILED 1-11
    ../lib/ExtUtils/t/recurs.t..............FAILED 1-25
    ../lib/ExtUtils/t/revision.t............FAILED 1-4
    ../lib/ExtUtils/t/split_command.t.......FAILED ??
    ../lib/ExtUtils/t/writemakefile_args.t..FAILED 1-16
    ../lib/ExtUtils/t/xs.t..................FAILED ??
    ../lib/File/Basename.t..................FAILED 1-64
    ../lib/File/Compare.t...................FAILED ??
    ../lib/File/Copy.t......................FAILED 21-60
    ../lib/File/Find/t/find.t...............FAILED ??
    ../lib/File/Find/t/taint.t..............FAILED 1-45
    ../lib/File/Path.t......................FAILED ??
    ../lib/File/Spec/t/Spec.t...............FAILED ??
    ../lib/File/Spec/t/crossplatform.t......FAILED 37-50
    ../lib/File/Temp/t/mktemp.t.............FAILED 1-9
    ../lib/File/Temp/t/object.t.............FAILED 1-26
    ../lib/File/Temp/t/posix.t..............FAILED 1-7
    ../lib/File/Temp/t/security.t...........FAILED 1-13
    ../lib/File/Temp/t/seekable.t...........FAILED 1-7
    ../lib/File/Temp/t/tempfile.t...........FAILED 1-22
    ../lib/FindBin.t........................FAILED ??
    ../lib/Module/Build/t/basic.t...........FAILED 1-55
    ../lib/Module/Build/t/compat.t..........FAILED ??
    ../lib/Module/Build/t/destinations.t....FAILED 1-113
    ../lib/Module/Build/t/ext.t.............FAILED ??
    ../lib/Module/Build/t/extend.t..........FAILED 1-64
    ../lib/Module/Build/t/files.t...........FAILED 1-6
    ../lib/Module/Build/t/install.t.........FAILED 1-34
    ../lib/Module/Build/t/manifypods.t......FAILED ??
    ../lib/Module/Build/t/metadata.t........FAILED 1-43
    ../lib/Module/Build/t/metadata2.t.......FAILED 1-18
    ../lib/Module/Build/t/moduleinfo.t......FAILED 1-75
    ../lib/Module/Build/t/notes.t...........FAILED 1-11
    ../lib/Module/Build/t/parents.t.........FAILED 1-27
    ../lib/Module/Build/t/ppm.t.............FAILED ??
    ../lib/Module/Build/t/runthrough.t......FAILED 1-32
    ../lib/Module/Build/t/signature.t.......FAILED ??
    ../lib/Module/Build/t/tilde.t...........FAILED 1-11
    ../lib/Module/Build/t/versions.t........FAILED 1-2
    ../lib/Module/Build/t/xs.t..............FAILED ??
    ../lib/Pod/Perldoc/t/checkerbasic.t.....FAILED 2
    ../lib/Pod/Simple/t/00about.t...........FAILED 5-27
    ../lib/Pod/Simple/t/htmlbatch_01.t......FAILED 1-8
    ../lib/Pod/Simple/t/render.t............FAILED 1-26
    ../lib/Pod/Simple/t/search_05sane.t.....FAILED ??
    ../lib/Pod/Simple/t/search_12survey_cwd.tFAILED ??
    ../lib/Pod/Simple/t/search_20survey_two.tFAILED ??
    ../lib/Pod/Simple/t/search_50survey_inc.tFAILED ??
    ../lib/Pod/t/Functions.t................FAILED ??
    ../lib/Pod/t/Usage.t....................FAILED ??
    ../lib/Pod/t/basic.t....................FAILED 3-11
    ../lib/Pod/t/contains_pod.t.............FAILED 1
    ../lib/Pod/t/filehandle.t...............FAILED 2-3
    ../lib/Pod/t/man.t......................FAILED 2-21
    ../lib/Pod/t/pod-parser.t...............FAILED 2-3
    ../lib/Text/TabsWrap/t/37000.t..........FAILED ??
    ../lib/Text/TabsWrap/t/39548.t..........FAILED ??
    ../lib/Text/TabsWrap/t/Jochen.t.........FAILED ??
    ../lib/Text/TabsWrap/t/belg4mit.t.......FAILED ??
    ../lib/Text/TabsWrap/t/fill.t...........FAILED ??
    ../lib/Text/TabsWrap/t/sep.t............FAILED ??
    ../lib/Text/TabsWrap/t/sep2.t...........FAILED ??
    ../lib/Text/TabsWrap/t/wrap.t...........FAILED ??
    ../lib/feature.t........................FAILED ??
    ../lib/h2ph.t...........................FAILED 1-2
    ../lib/h2xs.t...........................FAILED ??
    ../lib/lib.t............................FAILED 1-13
    ../lib/warnings.t.......................FAILED ??
    ../t/op/mkdir.t.........................FAILED ??
    ../t/op/pat.t...........................FAILED ??
    ../t/op/taint.t.........................FAILED ??
    ../t/pod/emptycmd.t.....................FAILED ??
    ../t/pod/find.t.........................FAILED 1-4
    ../t/pod/for.t..........................FAILED ??
    ../t/pod/headings.t.....................FAILED ??
    ../t/pod/include.t......................FAILED ??
    ../t/pod/included.t.....................FAILED ??
    ../t/pod/lref.t.........................FAILED ??
    ../t/pod/multiline_items.t..............FAILED ??
    ../t/pod/nested_items.t.................FAILED ??
    ../t/pod/nested_seqs.t..................FAILED ??
    ../t/pod/oneline_cmds.t.................FAILED ??
    ../t/pod/pod2usage.t....................FAILED ??
    ../t/pod/poderrs.t......................FAILED ??
    ../t/pod/podselect.t....................FAILED ??
    ../t/pod/special_seqs.t.................FAILED ??
Inconsistent test results (between TEST and harness):
    ../ext/Compress/IO/Zlib/t/108anyunc-gzip.tFAILED--no leader found
    ../lib/Pod/Simple/t/search_25_glob_squaa.tFAILED--no leader found
    ../ext/Compress/IO/Zlib/t/106prime-rawdeflate.tFAILED--no leader found
    ../lib/Pod/Simple/t/search_26_glob_kleene_k.tFAILED--no leader found
    ../ext/Compress/IO/Zlib/t/107multi-deflate.tFAILED--no leader found
    ../ext/Compress/IO/Zlib/t/050interop-gzip.tFAILED--no leader found
    ../ext/Compress/IO/Zlib/t/101truncate-rawdeflate.tFAILED--expected 625 tests, saw 0
    ../ext/Compress/IO/Zlib/t/102tied-deflate.tFAILED--no leader found
    ../ext/Compress/IO/Zlib/t/105oneshot-zip-only.tFAILED--no leader found
    ../ext/Compress/IO/Zlib/t/001zlib-generic-zip.tFAILED--no leader found
    ../ext/Compress/IO/Zlib/t/002any-transparent.tFAILED--no leader found
    ../ext/Compress/IO/Zlib/t/106prime-deflate.tFAILED--no leader found
    ../ext/Compress/IO/Zlib/t/105oneshot-rawdeflate.tFAILED--no leader found
    ../ext/Compress/IO/Zlib/t/002any-rawdeflate.tFAILED--no leader found
    ../ext/Compress/IO/Zlib/t/108anyunc-deflate.tFAILED--no leader found
    ../ext/Compress/IO/Zlib/t/108anyunc-rawdeflate.tFAILED--no leader found
    ../ext/Compress/IO/Zlib/t/103newtied-deflate.tFAILED--no leader found
    ../ext/Compress/IO/Zlib/t/105oneshot-gzip.tFAILED--no leader found
    ../ext/Compress/IO/Zlib/t/103newtied-zip.tFAILED--no leader found
    ../ext/Compress/IO/Zlib/t/104destroy-rawdeflate.tFAILED--no leader found
    ../ext/Compress/IO/Zlib/t/103newtied-gzip.tFAILED--no leader found
    ../ext/Compress/IO/Zlib/t/107multi-rawdeflate.tFAILED--no leader found
    ../lib/Pod/Simple/t/search_27_glob_squaa_kleene.tFAILED--no leader found
    ../lib/Pod/Simple/t/search_29_glob_z_qmark_k.tFAILED--no leader found
    ../ext/Compress/IO/Zlib/t/001zlib-generic-gzip.tFAILED--no leader found
    ../ext/Compress/IO/Zlib/t/002any-deflate.tFAILED--no leader found
    ../ext/Compress/IO/Zlib/t/105oneshot-deflate.tFAILED--no leader found
    ../lib/Pod/Simple/t/search_28_glob_z_kleene_k.tFAILED--no leader found
    ../ext/Compress/IO/Zlib/t/109merge-rawdeflate.tFAILED--no leader found
    ../ext/Compress/IO/Zlib/t/100generic-zip.tFAILED--no leader found
    ../ext/Compress/IO/Zlib/t/101truncate-deflate.tFAILED--expected 734 tests, saw 0
    ../ext/Compress/IO/Zlib/t/108anyunc-transparent.tFAILED--no leader found
    ../ext/Compress/IO/Zlib/t/104destroy-deflate.tFAILED--no leader found
    ../ext/Compress/IO/Zlib/t/104destroy-gzip.tFAILED--no leader found
    ../ext/Compress/IO/Zlib/t/001zlib-generic-rawdeflate.tFAILED--no leader found
    ../ext/Compress/IO/Zlib/t/100generic-deflate.tFAILED--no leader found
    ../ext/Compress/IO/Zlib/t/103newtied-rawdeflate.tFAILED--no leader found
    ../ext/Compress/IO/Zlib/t/105oneshot-zip.tFAILED--no leader found
    ../ext/Compress/IO/Zlib/t/109merge-deflate.tFAILED--no leader found
    ../ext/Compress/IO/Zlib/t/101truncate-zip.tFAILED--expected 2316 tests, saw 0
    ../ext/Compress/IO/Zlib/t/101truncate-gzip.tFAILED--expected 978 tests, saw 0
    ../ext/Compress/IO/Zlib/t/105oneshot-gzip-only.tFAILED--no leader found
    ../lib/Pod/Simple/t/search_10survey_specific.tFAILED--no leader found
    ../ext/Compress/IO/Zlib/t/102tied-rawdeflate.tFAILED--no leader found
    ../ext/Compress/IO/Zlib/t/001zlib-generic-deflate.tFAILED--no leader found
    ../lib/Pod/Simple/t/search_22survey_two_shadowing.tFAILED--no leader found
    ../ext/Compress/IO/Zlib/t/104destroy-zip.tFAILED--no leader found
    ../ext/Compress/IO/Zlib/t/100generic-gzip.tFAILED--no leader found
    ../ext/Compress/IO/Zlib/t/100generic-rawdeflate.tFAILED--no leader found

Compiler messages(gcc):
op.c: In function `Perl_fold_constants':
op.c:2122: warning: variable `sv' might be clobbered by `longjmp' or `vfork'
mg.c: In function `Perl_sighandler':
mg.c:2785: warning: null format string
pp.c: In function `Perl_pp_ord':
pp.c:3326: warning: signed and unsigned type in conditional expression
pp_sys.c: In function `Perl_pp_die':
pp_sys.c:505: warning: null format string
pp_sys.c:309: warning: `S_emulate_eaccess' defined but not used
doio.c: In function `Perl_do_msgsnd':
doio.c:2128: warning: unused parameter `mark'
doio.c:2128: warning: unused parameter `sp'
doio.c: In function `Perl_do_msgrcv':
doio.c:2151: warning: unused parameter `mark'
doio.c:2151: warning: unused parameter `sp'
regexec.c: In function `S_regmatch':
regexec.c:3680: warning: empty body in an if-statement
regexec.c:3765: warning: empty body in an if-statement
regexec.c:3843: warning: empty body in an if-statement
opmini.c: In function `Perl_fold_constants':
opmini.c:2122: warning: variable `sv' might be clobbered by `longjmp' or `vfork'
regcomp.c: In function `S_make_trie':
regcomp.c:1758: warning: `optimize' might be used uninitialized in this function

-- 
Report by Test::Smoke v1.19_83 build 980 running on perl 5.6.0
(Reporter v0.026 / Smoker v0.029)




nntp.perl.org: Perl Programming lists via nntp and http.
Comments to Ask Bjørn Hansen at ask@perl.org | Group listing | About