develooper Front page | perl.perl5.porters | Postings from September 2006

Smoke [5.9.4] 28895 FAIL(XF) Solaris 2.11 (i386/1 cpu)

From:
steve
Date:
September 27, 2006 22:01
Subject:
Smoke [5.9.4] 28895 FAIL(XF) Solaris 2.11 (i386/1 cpu)
Message ID:
200609280459.k8S4xVA0026433@sulu
Automated smoke report for 5.9.4 patch 28895
sulu:  (1700MHz) (i386/1 cpu)
    on        Solaris - 2.11
    using     /usr/sfw/bin/gcc version 3.4.3 (csl-sol210-3_4-20050802)
    smoketime 15 hours 59 minutes (average 59 minutes 57 seconds)

Summary: FAIL(XF)

O = OK  F = Failure(s), extended report at the bottom
X = Failure(s) under TEST but not under harness
? = still running or test results not (yet) available
Build failures during:       - = unknown or N/A
c = Configure, m = make, M = make (after miniperl), t = make test-prep

   28895     Configuration (common) -Dcc=/usr/sfw/bin/gcc
----------- ---------------------------------------------------------
O O F O O F 
O O F O O F -Duse64bitint
O O F O O F -Duselongdouble
O O F O O F -Dusemorebits
O O F O O F -Duseithreads
O O F X O F -Duseithreads -Duse64bitint
O O F O O F -Duseithreads -Duselongdouble
O O F O O F -Duseithreads -Dusemorebits
| | | | | +- LC_ALL = en_US.UTF-8 -DDEBUGGING
| | | | +--- PERLIO = perlio -DDEBUGGING
| | | +----- PERLIO = stdio  -DDEBUGGING
| | +------- LC_ALL = en_US.UTF-8
| +--------- PERLIO = perlio
+----------- PERLIO = stdio

Locally applied patches:
    SMOKE28895

Failures: (common-args) -Dcc=/usr/sfw/bin/gcc
[en_US.UTF-8] 
[en_US.UTF-8] -Duse64bitint
[en_US.UTF-8] -Duselongdouble
[en_US.UTF-8] -Dusemorebits
[en_US.UTF-8] -Duseithreads
[en_US.UTF-8] -DDEBUGGING -Duseithreads
[en_US.UTF-8] -Duseithreads -Duse64bitint
[en_US.UTF-8] -DDEBUGGING -Duseithreads -Duse64bitint
[en_US.UTF-8] -Duseithreads -Duselongdouble
[en_US.UTF-8] -DDEBUGGING -Duseithreads -Duselongdouble
[en_US.UTF-8] -Duseithreads -Dusemorebits
[en_US.UTF-8] -DDEBUGGING -Duseithreads -Dusemorebits
    ../lib/warnings.t.......................FAILED 263

[en_US.UTF-8] -DDEBUGGING
[en_US.UTF-8] -DDEBUGGING -Duse64bitint
[en_US.UTF-8] -DDEBUGGING -Duselongdouble
[en_US.UTF-8] -DDEBUGGING -Dusemorebits
    ../lib/strict.t.........................FAILED 84-85
    ../lib/subs.t...........................FAILED 2
    ../lib/warnings.t.......................FAILED 123-124 138 145-147 155 158 263
                                                   310 454 498-499
    ../t/run/fresh_perl.t...................FAILED 48

[stdio] -DDEBUGGING -Duseithreads -Duse64bitint
Inconsistent test results (between TEST and harness):
    ../ext/threads/t/free.t.................FAILED--expected 29 tests, saw 17

Compiler messages(gcc):
op.c: In function `Perl_fold_constants':
op.c:2122: warning: variable 'sv' might be clobbered by `longjmp' or `vfork'
doio.c: In function `Perl_my_stat':
doio.c:1336: warning: control reaches end of non-void function
regexec.c:5183: warning: 'S_reghop4' defined but not used
opmini.c: In function `Perl_fold_constants':
opmini.c:2122: warning: variable 'sv' might be clobbered by `longjmp' or `vfork'
../../regnodes.h:350: warning: `reg_name' initialized and declared `extern'
regnodes.h:350: warning: `reg_name' initialized and declared `extern'
reentr.c: In function `Perl_reentrant_size':
reentr.c:47: warning: comparison between signed and unsigned
reentr.c:82: warning: comparison between signed and unsigned
reentr.c:104: warning: comparison between signed and unsigned
re.xs:50: warning: initialization from incompatible pointer type
re.xs: In function `install':
re.xs:90: warning: assignment from incompatible pointer type

-- 
Report by Test::Smoke v1.19_83 build 980 running on perl 5.8.4
(Reporter v0.026 / Smoker v0.029)




nntp.perl.org: Perl Programming lists via nntp and http.
Comments to Ask Bjørn Hansen at ask@perl.org | Group listing | About