develooper Front page | perl.perl5.porters | Postings from April 2006

Smoke [5.9.4] 27836 FAIL(F) netbsd 3.0 (i386/1 cpu)

From:
steve
Date:
April 16, 2006 07:47
Subject:
Smoke [5.9.4] 27836 FAIL(F) netbsd 3.0 (i386/1 cpu)
Message ID:
200604161444.k3GEivFY020454@scotty.peters.homeunix.org
Automated smoke report for 5.9.4 patch 27836
scotty.peters.homeunix.org: Intel Pentium III (686-class) (i386/1 cpu)
    on        netbsd - 3.0
    using     cc version 3.3.3 (NetBSD nb3 20040520)
    smoketime 5 hours 49 minutes (average 43 minutes 44 seconds)

Summary: FAIL(F)

O = OK  F = Failure(s), extended report at the bottom
X = Failure(s) under TEST but not under harness
? = still running or test results not (yet) available
Build failures during:       - = unknown or N/A
c = Configure, m = make, M = make (after miniperl), t = make test-prep

   27836     Configuration (common) none
----------- ---------------------------------------------------------
F F F F     
F F F F     -Duse64bitint
F F F F     -Duseithreads
F F F F     -Duseithreads -Duse64bitint
| | | +----- PERLIO = perlio -DDEBUGGING
| | +------- PERLIO = stdio  -DDEBUGGING
| +--------- PERLIO = perlio
+----------- PERLIO = stdio

Locally applied patches:
    SMOKE27836

Failures: (common-args) none
[stdio/perlio] 
[stdio/perlio] -DDEBUGGING
[stdio/perlio] -Duseithreads
[stdio/perlio] -DDEBUGGING -Duseithreads
    ../lib/Pod/t/htmllink.t.................FAILED 1

[stdio/perlio] -Duse64bitint
[stdio/perlio] -DDEBUGGING -Duse64bitint
    ../ext/B/t/bytecode.t...................FAILED 3-12 14-19
    ../lib/Pod/t/htmllink.t.................FAILED 1

[stdio/perlio] -Duseithreads -Duse64bitint
[stdio/perlio] -DDEBUGGING -Duseithreads -Duse64bitint
    ../ext/B/t/bytecode.t...................FAILED 1-19
    ../lib/Pod/t/htmllink.t.................FAILED 1

Compiler messages(gcc):
gv.c: In function `Perl_gv_fetchmethod_autoload':
gv.c:559: warning: null argument where non-null required (arg 2)
gv.c: In function `Perl_gv_fullname4':
gv.c:1268: warning: null argument where non-null required (arg 2)
regcomp.c: In function `S_study_chunk':
regcomp.c:1581: warning: comparison is always false due to limited range of data type
hv.c: In function `Perl_refcounted_he_new':
hv.c:2691: warning: `value_p' might be used uninitialized in this function
pp_hot.c: In function `Perl_pp_entersub':
pp_hot.c:2776: warning: null argument where non-null required (arg 2)
sv.c: In function `Perl_sv_upgrade':
sv.c:1254: warning: comparison is always false due to limited range of data type
sv.c:1308: warning: comparison is always false due to limited range of data type
pp.c: In function `Perl_pp_rv2cv':
pp.c:363: warning: null argument where non-null required (arg 2)
pp.c: In function `Perl_pp_splice':
pp.c:4126: warning: `tmparyval' might be used uninitialized in this function
pp_ctl.c: In function `Perl_pp_goto':
pp_ctl.c:2318: warning: null argument where non-null required (arg 2)
pp_ctl.c: In function `S_run_user_filter':
pp_ctl.c:4529: warning: `got_p' might be used uninitialized in this function
pp_sys.c: In function `Perl_pp_select':
pp_sys.c:1169: warning: null argument where non-null required (arg 2)
regexec.c: In function `S_regmatch':
regexec.c:4317: warning: comparison is always false due to limited range of data type
regexec.c:4328: warning: comparison is always false due to limited range of data type
byterun.c: In function `byterun':
byterun.c:894: warning: comparison is always false due to limited range of data type
re_exec.c: In function `S_regmatch':
re_exec.c:4317: warning: comparison is always false due to limited range of data type
re_exec.c:4328: warning: comparison is always false due to limited range of data type
re_comp.c: In function `S_study_chunk':
re_comp.c:1581: warning: comparison is always false due to limited range of data type
gv.c:558: warning: null argument where non-null required (arg 3)
gv.c:1268: warning: null argument where non-null required (arg 3)
pp_hot.c:2775: warning: null argument where non-null required (arg 3)
sv.c: In function `Perl_sv_dup':
sv.c:9994: warning: comparison is always false due to limited range of data type
pp.c:363: warning: null argument where non-null required (arg 3)
pp_ctl.c:2317: warning: null argument where non-null required (arg 3)
pp_sys.c:1169: warning: null argument where non-null required (arg 3)

-- 
Report by Test::Smoke v1.19_76 build 914 running on perl 5.8.7
(Reporter v0.026 / Smoker v0.027)




nntp.perl.org: Perl Programming lists via nntp and http.
Comments to Ask Bjørn Hansen at ask@perl.org | Group listing | About