develooper Front page | perl.perl5.porters | Postings from April 2006

Smoke [5.9.4] 27706 FAIL(Xc) openbsd 3.8 (i386/1 cpu)

Thread Next
From:
steve
Date:
April 4, 2006 05:38
Subject:
Smoke [5.9.4] 27706 FAIL(Xc) openbsd 3.8 (i386/1 cpu)
Message ID:
200604041238.k34Cc2Qf001483@mccoy.peters.homeunix.org
Automated smoke report for 5.9.4 patch 27706
mccoy.peters.homeunix.org: Intel Pentium III ("GenuineIntel" 686-class, 512KB L2 cache) (548 MHz) (i386/1 cpu)
    on        openbsd - 3.8
    using     cc version 3.3.5 (propolice)
    smoketime 5 hours 32 minutes (average 1 hour 23 minutes)

Summary: FAIL(Xc)

O = OK  F = Failure(s), extended report at the bottom
X = Failure(s) under TEST but not under harness
? = still running or test results not (yet) available
Build failures during:       - = unknown or N/A
c = Configure, m = make, M = make (after miniperl), t = make test-prep

   27706     Configuration (common) none
----------- ---------------------------------------------------------
O X c -     
c - - -     -Duse64bitint
| | | +----- PERLIO = perlio -DDEBUGGING
| | +------- PERLIO = stdio  -DDEBUGGING
| +--------- PERLIO = perlio
+----------- PERLIO = stdio


Failures: (common-args) none
[perlio] 
Inconsistent test results (between TEST and harness):
    ../lib/Module/Build/t/extend.t..........FAILED--expected 53 tests, saw 37
    ../lib/Module/Build/t/basic.t...........FAILED--expected 55 tests, saw 0
    ../lib/Module/Build/t/compat.t..........FAILED--expected 60 tests, saw 1

Compiler messages(gcc):
/tmp//ccH24836.o(.text+0x3e): In function `main':
/tmp//ccF16541.o(.text+0x5d): In function `main':
/tmp//cce19005.o(.text+0xde): In function `main':
gv.c: In function `Perl_gv_fetchmethod_autoload':
gv.c:559: warning: null argument where non-null required (arg 2)
gv.c: In function `Perl_gv_fullname4':
gv.c:1268: warning: null argument where non-null required (arg 2)
op.c: In function `Perl_fold_constants':
op.c:2145: warning: `sv' might be used uninitialized in this function
regcomp.c: In function `S_study_chunk':
regcomp.c:1580: warning: comparison is always false due to limited range of data type
pp_hot.c: In function `Perl_pp_entersub':
pp_hot.c:2776: warning: null argument where non-null required (arg 2)
sv.c: In function `Perl_sv_upgrade':
sv.c:1254: warning: comparison is always false due to limited range of data type
sv.c:1308: warning: comparison is always false due to limited range of data type
pp.c: In function `Perl_pp_rv2cv':
pp.c:363: warning: null argument where non-null required (arg 2)
pp_ctl.c: In function `Perl_pp_goto':
pp_ctl.c:2318: warning: null argument where non-null required (arg 2)
pp_sys.c: In function `Perl_pp_select':
pp_sys.c:1169: warning: null argument where non-null required (arg 2)
pp_sys.c: In function `Perl_pp_ggrent':
pp_sys.c:5197: warning: unused variable `sv'
regexec.c: In function `S_regmatch':
regexec.c:4309: warning: comparison is always false due to limited range of data type
regexec.c:4320: warning: comparison is always false due to limited range of data type
opmini.c: In function `Perl_fold_constants':
opmini.c:2145: warning: `sv' might be used uninitialized in this function
perlio.o(.text+0x4ff4): In function `PerlIO_vsprintf':
util.o(.text+0x2bc1): In function `Perl_find_script':
toke.o(.text+0x7806): In function `Perl_yylex':
libperl.a(perlio.o)(.text+0x4ff4): In function `PerlIO_vsprintf':
libperl.a(op.o)(.text+0x304): In function `Perl_allocmy':
libperl.a(util.o)(.text+0x3f49): In function `Perl_upg_version':
libperl.a(DynaLoader.o)(.text+0x23e): In function `XS_DynaLoader_dl_load_file':
util.o(.text+0x1b3): In function `savestr':
str.o(.text+0x5d): In function `str_2ptr':
byterun.c: In function `byterun':
byterun.c:893: warning: comparison is always false due to limited range of data type
re_exec.c: In function `S_regmatch':
re_exec.c:4309: warning: comparison is always false due to limited range of data type
re_exec.c:4320: warning: comparison is always false due to limited range of data type
re_comp.c: In function `S_study_chunk':
re_comp.c:1580: warning: comparison is always false due to limited range of data type
TSTENV = stdio	../libperl.a(perlio.o)(.text+0x4ff4): In function `PerlIO_vsprintf':
../libperl.a(pp_ctl.o)(.text+0x83be): In function `Perl_pp_entereval':
../libperl.a(sv.o)(.text+0x1ce4): In function `Perl_sv_2pv_flags':
TSTENV = perlio	../libperl.a(perlio.o)(.text+0x4ff4): In function `PerlIO_vsprintf':
/tmp//ccU29759.o(.text+0x3e): In function `main':
/tmp//ccX21523.o(.text+0x5d): In function `main':
/tmp//ccu13152.o(.text+0xde): In function `main':

-- 
Report by Test::Smoke v1.19_71 build 874 running on perl 5.8.6
(Reporter v0.022 / Smoker v0.025)


Thread Next


nntp.perl.org: Perl Programming lists via nntp and http.
Comments to Ask Bjørn Hansen at ask@perl.org | Group listing | About