develooper Front page | perl.perl5.porters | Postings from March 2006

Smoke [5.9.4] 27608 FAIL(XF) openbsd 3.6 (i386/1 cpu)

From:
schubiger
Date:
March 25, 2006 19:20
Subject:
Smoke [5.9.4] 27608 FAIL(XF) openbsd 3.6 (i386/1 cpu)
Message ID:
200603260325.k2Q3PC3j007167@do.homeunix.org
Automated smoke report for 5.9.4 patch 27608
do.homeunix.org: AMD Athlon(TM) XP 1800+ ("AuthenticAMD" 686-class) (i386/1 cpu)
    on        openbsd - 3.6
    using     cc version 2.95.3 20010125 (prerelease, propolice)
    smoketime 4 hours 24 minutes (average 33 minutes)

Summary: FAIL(XF)

O = OK  F = Failure(s), extended report at the bottom
X = Failure(s) under TEST but not under harness
? = still running or test results not (yet) available
Build failures during:       - = unknown or N/A
c = Configure, m = make, M = make (after miniperl), t = make test-prep

   27608     Configuration (common) none
----------- ---------------------------------------------------------
O O X X     
F F F F     -Duse64bitint
X X X X     -Duseithreads
F F F F     -Duseithreads -Duse64bitint
| | | +----- PERLIO = perlio -DDEBUGGING
| | +------- PERLIO = stdio  -DDEBUGGING
| +--------- PERLIO = perlio
+----------- PERLIO = stdio


Failures:
[stdio/perlio] -DDEBUGGING
Inconsistent test results (between TEST and harness):
    ../ext/Compress/IO/Zlib/t/105oneshot-zip-only.tFAILED at test 46

[stdio/perlio] -Duse64bitint
    ../lib/Time/Local.t.....................FAILED 133
Inconsistent test results (between TEST and harness):
    ../ext/Compress/IO/Zlib/t/105oneshot-zip-only.tFAILED at test 46

[stdio/perlio] -DDEBUGGING -Duse64bitint
    ../lib/Time/Local.t.....................FAILED 133
Inconsistent test results (between TEST and harness):
    ../ext/Compress/IO/Zlib/t/105oneshot-zip-only.tFAILED at test 35

[stdio/perlio] -Duseithreads
[perlio] -DDEBUGGING -Duseithreads
Inconsistent test results (between TEST and harness):
    ../ext/Compress/IO/Zlib/t/105oneshot-zip-only.tFAILED at test 13

[stdio] -DDEBUGGING -Duseithreads
Inconsistent test results (between TEST and harness):
    ../ext/Compress/IO/Zlib/t/105oneshot-zip-only.tFAILED at test 13
    ../lib/Module/Build/t/compat.t..........FAILED at test 25

[stdio/perlio] -Duseithreads -Duse64bitint
[stdio/perlio] -DDEBUGGING -Duseithreads -Duse64bitint
    ../lib/Time/Local.t.....................FAILED 133

-- 
Report by Test::Smoke v1.19#716 running on perl 5.8.5
(Reporter v0.016 / Smoker v0.015)




nntp.perl.org: Perl Programming lists via nntp and http.
Comments to Ask Bjørn Hansen at ask@perl.org | Group listing | About