develooper Front page | perl.perl5.porters | Postings from March 2006

Smoke [5.9.4] 27564 FAIL(F) linux 2.6.15-18-386 [debian] (i686/1 cpu)

From:
steve
Date:
March 22, 2006 10:16
Subject:
Smoke [5.9.4] 27564 FAIL(F) linux 2.6.15-18-386 [debian] (i686/1 cpu)
Message ID:
20060322181705.78B1865A9E@fisharerojo.org
Automated smoke report for 5.9.4 patch 27564
kirk: Intel(R) Celeron(R) CPU 2.00GHz (GenuineIntel 1994MHz) (i686/1 cpu)
    on        linux - 2.6.15-18-386 [debian]
    using     cc version 4.0.3 (Ubuntu 4.0.3-1ubuntu3)
    smoketime 16 hours 32 minutes (average 1 hour 2 minutes)

Summary: FAIL(F)

O = OK  F = Failure(s), extended report at the bottom
X = Failure(s) under TEST but not under harness
? = still running or test results not (yet) available
Build failures during:       - = unknown or N/A
c = Configure, m = make, M = make (after miniperl), t = make test-prep

   27564     Configuration (common) none
----------- ---------------------------------------------------------
O O O F O O 
F O O F O O -Duse64bitint
F O O F O O -Duselongdouble
F O O F O O -Dusemorebits
F O O F O O -Duseithreads
F O O F O O -Duseithreads -Duse64bitint
F O O F O O -Duseithreads -Duselongdouble
F O O F O O -Duseithreads -Dusemorebits
| | | | | +- LC_ALL = en_US.utf8 -DDEBUGGING
| | | | +--- PERLIO = perlio -DDEBUGGING
| | | +----- PERLIO = stdio  -DDEBUGGING
| | +------- LC_ALL = en_US.utf8
| +--------- PERLIO = perlio
+----------- PERLIO = stdio

Locally applied patches:
    SMOKE27564

Failures: (common-args) none
[stdio] -DDEBUGGING
    ../ext/Compress/Zlib/t/14gzopen.t.......FAILED 139-210
    ../t/io/dup.t...........................FAILED 15-26
    ../t/io/open.t..........................FAILED 93
Inconsistent test results (between TEST and harness):
    ../ext/Compress/IO/Zlib/t/100generic-gzip.tFAILED--expected 601 tests, saw 81
    ../ext/Compress/IO/Zlib/t/105oneshot-rawdeflate.tFAILED--expected 944 tests, saw 157
    ../ext/Compress/IO/Zlib/t/105oneshot-deflate.tFAILED--expected 944 tests, saw 157
    ../ext/Compress/IO/Zlib/t/100generic-deflate.tFAILED--expected 601 tests, saw 81
    ../ext/Compress/IO/Zlib/t/100generic-zip.tFAILED--expected 601 tests, saw 81
    ../ext/Compress/IO/Zlib/t/105oneshot-zip.tFAILED--expected 944 tests, saw 157
    ../ext/Compress/IO/Zlib/t/100generic-rawdeflate.tFAILED--expected 601 tests, saw 81
    ../ext/Compress/IO/Zlib/t/105oneshot-gzip.tFAILED--expected 944 tests, saw 157

[stdio] -Duse64bitint
[stdio] -DDEBUGGING -Duse64bitint
[stdio] -Duselongdouble
[stdio] -DDEBUGGING -Duselongdouble
[stdio] -Dusemorebits
[stdio] -DDEBUGGING -Dusemorebits
    ../ext/Compress/Zlib/t/14gzopen.t.......FAILED 139-210
    ../t/io/dup.t...........................FAILED 15-26
    ../t/io/open.t..........................FAILED 93
Inconsistent test results (between TEST and harness):
    ../ext/Compress/IO/Zlib/t/100generic-gzip.tFAILED--expected 601 tests, saw 81
    ../ext/Compress/IO/Zlib/t/105oneshot-rawdeflate.tFAILED--expected 944 tests, saw 157
    ../ext/Compress/IO/Zlib/t/105oneshot-deflate.tFAILED--expected 944 tests, saw 157
    ../ext/Compress/IO/Zlib/t/100generic-deflate.tFAILED--expected 601 tests, saw 81
    ../ext/Compress/IO/Zlib/t/100generic-zip.tFAILED--expected 601 tests, saw 81
    ../ext/Compress/IO/Zlib/t/100generic-rawdeflate.tFAILED--expected 601 tests, saw 81
    ../ext/Compress/IO/Zlib/t/105oneshot-zip.tFAILED--expected 944 tests, saw 157
    ../ext/Compress/IO/Zlib/t/105oneshot-gzip.tFAILED--expected 944 tests, saw 157

[stdio] -Duseithreads
[stdio] -DDEBUGGING -Duseithreads
[stdio] -Duseithreads -Duse64bitint
[stdio] -DDEBUGGING -Duseithreads -Duse64bitint
[stdio] -Duseithreads -Duselongdouble
[stdio] -DDEBUGGING -Duseithreads -Duselongdouble
[stdio] -Duseithreads -Dusemorebits
[stdio] -DDEBUGGING -Duseithreads -Dusemorebits
    ../ext/Compress/Zlib/t/14gzopen.t.......FAILED 139-210
    ../ext/Storable/t/threads.t.............FAILED 1-2
    ../ext/XS/APItest/t/my_cxt.t............FAILED 6-11
    ../ext/threads/shared/t/av_refs.t.......FAILED 4-11
    ../ext/threads/shared/t/blessed.t.......FAILED 1-36
    ../ext/threads/shared/t/cond.t..........FAILED 2-31
    ../ext/threads/shared/t/hv_refs.t.......FAILED 4-17
    ../ext/threads/shared/t/sv_refs.t.......FAILED 7-10
    ../ext/threads/shared/t/wait.t..........FAILED 1-102
    ../ext/threads/t/basic.t................FAILED 2-19
    ../ext/threads/t/end.t..................FAILED 2-6
    ../ext/threads/t/join.t.................FAILED 2-14
    ../ext/threads/t/libc.t.................FAILED 1-11
    ../ext/threads/t/list.t.................FAILED 3-8
    ../ext/threads/t/problems.t.............FAILED 1-14
    ../ext/threads/t/stress_cv.t............FAILED 4-64
    ../ext/threads/t/stress_re.t............FAILED 4-64
    ../ext/threads/t/stress_string.t........FAILED 4-64
    ../ext/threads/t/thread.t...............FAILED 2-31
    ../lib/Test/Simple/t/sort_bug.t.........FAILED 1-2
    ../lib/Test/Simple/t/threads.t..........FAILED 1-6
    ../lib/Thread/Queue.t...................FAILED 1-26
    ../t/io/dup.t...........................FAILED 15-26
    ../t/io/open.t..........................FAILED 93
    ../t/op/getpid.t........................FAILED 2-3
    ../t/op/threads.t.......................FAILED 1-5
Inconsistent test results (between TEST and harness):
    ../ext/Compress/IO/Zlib/t/100generic-gzip.tFAILED--expected 601 tests, saw 81
    ../ext/threads/shared/t/no_share.t......FAILED--expected 5 tests, saw 3
    ../ext/Compress/IO/Zlib/t/105oneshot-deflate.tFAILED--expected 944 tests, saw 157
    ../ext/threads/shared/t/av_simple.t.....FAILED--expected 43 tests, saw 9
    ../ext/Compress/IO/Zlib/t/100generic-zip.tFAILED--expected 601 tests, saw 81
    ../ext/Compress/IO/Zlib/t/105oneshot-zip.tFAILED--expected 944 tests, saw 157
    ../ext/Compress/IO/Zlib/t/105oneshot-gzip.tFAILED--expected 944 tests, saw 157
    ../ext/threads/shared/t/hv_simple.t.....FAILED--expected 15 tests, saw 2
    ../ext/Compress/IO/Zlib/t/100generic-deflate.tFAILED--expected 601 tests, saw 81
    ../ext/threads/shared/t/shared_attr.t...FAILED--expected 81 tests, saw 2
    ../ext/threads/shared/t/sv_simple.t.....FAILED--expected 10 tests, saw 3
    ../ext/Compress/IO/Zlib/t/105oneshot-rawdeflate.tFAILED--expected 944 tests, saw 157
    ../ext/Compress/IO/Zlib/t/100generic-rawdeflate.tFAILED--expected 601 tests, saw 81

Compiler messages(gcc):
gv.c: In function ‘Perl_gv_fetchmethod_autoload’:
gv.c:559: warning: null argument where non-null required (argument 2)
gv.c: In function ‘Perl_gv_fullname4’:
gv.c:1262: warning: null argument where non-null required (argument 2)
gv.c: In function ‘Perl_Gv_AMupdate’:
gv.c:1513: warning: null argument where non-null required (argument 1)
regcomp.c: In function ‘S_study_chunk’:
regcomp.c:1580: warning: comparison is always false due to limited range of data type
pp_hot.c: In function ‘S_get_db_sub’:
pp_hot.c:2659: warning: null argument where non-null required (argument 1)
pp_hot.c: In function ‘Perl_pp_entersub’:
pp_hot.c:2772: warning: null argument where non-null required (argument 2)
sv.c: In function ‘Perl_sv_upgrade’:
sv.c:1257: warning: comparison is always false due to limited range of data type
sv.c:1311: warning: comparison is always false due to limited range of data type
pp.c: In function ‘Perl_pp_rv2cv’:
pp.c:363: warning: null argument where non-null required (argument 2)
pp_ctl.c: In function ‘Perl_pp_goto’:
pp_ctl.c:2313: warning: null argument where non-null required (argument 2)
pp_sys.c: In function ‘Perl_pp_select’:
pp_sys.c:1172: warning: null argument where non-null required (argument 2)
byterun.c: In function ‘byterun’:
byterun.c:893: warning: comparison is always false due to limited range of data type
re_comp.c: In function ‘S_study_chunk’:
re_comp.c:1580: warning: comparison is always false due to limited range of data type
gv.c:558: warning: null argument where non-null required (argument 3)
gv.c:1262: warning: null argument where non-null required (argument 3)
pp_hot.c:2771: warning: null argument where non-null required (argument 3)
sv.c: In function ‘Perl_sv_dup’:
sv.c:9840: warning: comparison is always false due to limited range of data type
pp.c:363: warning: null argument where non-null required (argument 3)
pp_ctl.c:2312: warning: null argument where non-null required (argument 3)
pp_sys.c:1172: warning: null argument where non-null required (argument 3)

-- 
Report by Test::Smoke v1.19_76 build 914 running on perl 5.8.7
(Reporter v0.026 / Smoker v0.027)




nntp.perl.org: Perl Programming lists via nntp and http.
Comments to Ask Bjørn Hansen at ask@perl.org | Group listing | About