develooper Front page | perl.perl5.porters | Postings from March 2006

Smoke [5.9.4] 27513 FAIL(F) openbsd 3.8 (i386/1 cpu)

From:
steve
Date:
March 18, 2006 18:35
Subject:
Smoke [5.9.4] 27513 FAIL(F) openbsd 3.8 (i386/1 cpu)
Message ID:
200603190235.k2J2ZXco013786@mccoy.peters.homeunix.org
Automated smoke report for 5.9.4 patch 27513
mccoy.peters.homeunix.org: Intel Pentium III ("GenuineIntel" 686-class, 512KB L2 cache) (548 MHz) (i386/1 cpu)
    on        openbsd - 3.8
    using     cc version 3.3.5 (propolice)
    smoketime 2 days 18 hours 29 minutes (average 8 hours 18 minutes)

Summary: FAIL(F)

O = OK  F = Failure(s), extended report at the bottom
X = Failure(s) under TEST but not under harness
? = still running or test results not (yet) available
Build failures during:       - = unknown or N/A
c = Configure, m = make, M = make (after miniperl), t = make test-prep

   27513     Configuration (common) none
----------- ---------------------------------------------------------
F F F F     
F F F F     -Duse64bitint
F F F F     -Duseithreads
F F F F     -Duseithreads -Duse64bitint
| | | +----- PERLIO = perlio -DDEBUGGING
| | +------- PERLIO = stdio  -DDEBUGGING
| +--------- PERLIO = perlio
+----------- PERLIO = stdio


Failures: (common-args) none
[stdio/perlio] 
[stdio/perlio] -DDEBUGGING
[stdio/perlio] -Duse64bitint
[stdio/perlio] -DDEBUGGING -Duse64bitint
[stdio/perlio] -Duseithreads
[stdio/perlio] -DDEBUGGING -Duseithreads
[stdio/perlio] -Duseithreads -Duse64bitint
[stdio/perlio] -DDEBUGGING -Duseithreads -Duse64bitint
    ../lib/Module/Build/t/compat.t..........FAILED 3-10 13-20 38
                                                   41 43 45-46
                                                   48-55 59
    ../lib/Module/Build/t/ext.t.............FAILED 92
Inconsistent test results (between TEST and harness):
    ../ext/Compress/IO/Zlib/t/050interop-gzip.tFAILED at test 4

Compiler messages(gcc):
/tmp//ccu28924.o(.text+0x3e): In function `main':
/tmp//ccfR9585.o(.text+0x5d): In function `main':
/tmp//ccU25191.o(.text+0xde): In function `main':
gv.c: In function `Perl_gv_fetchmethod_autoload':
gv.c:559: warning: null argument where non-null required (arg 2)
gv.c: In function `Perl_gv_fullname4':
gv.c:1260: warning: null argument where non-null required (arg 2)
regcomp.c: In function `S_study_chunk':
regcomp.c:1580: warning: comparison is always false due to limited range of data type
pp_hot.c: In function `Perl_pp_entersub':
pp_hot.c:2764: warning: null argument where non-null required (arg 2)
sv.c: In function `Perl_sv_upgrade':
sv.c:1257: warning: comparison is always false due to limited range of data type
sv.c:1311: warning: comparison is always false due to limited range of data type
pp.c: In function `Perl_pp_rv2cv':
pp.c:363: warning: null argument where non-null required (arg 2)
pp_ctl.c: In function `Perl_pp_goto':
pp_ctl.c:2309: warning: null argument where non-null required (arg 2)
pp_sys.c: In function `Perl_pp_select':
pp_sys.c:1172: warning: null argument where non-null required (arg 2)
libperl.a(perlio.o)(.text+0x4ff4): In function `PerlIO_vsprintf':
opmini.o(.text+0x304): In function `Perl_allocmy':
libperl.a(toke.o)(.text+0x7806): In function `Perl_yylex':
libperl.a(op.o)(.text+0x304): In function `Perl_allocmy':
lib/auto/DynaLoader/DynaLoader.a(DynaLoader.o)(.text+0x23e): In function `XS_DynaLoader_dl_load_file':
util.o(.text+0x1b3): In function `savestr':
str.o(.text+0x5d): In function `str_2ptr':
byterun.c: In function `byterun':
byterun.c:893: warning: comparison is always false due to limited range of data type
re_comp.c: In function `S_study_chunk':
re_comp.c:1580: warning: comparison is always false due to limited range of data type
../libperl.a(perlio.o)(.text+0x4ff4): In function `PerlIO_vsprintf':
../libperl.a(op.o)(.text+0x304): In function `Perl_allocmy':
../libperl.a(toke.o)(.text+0x7806): In function `Perl_yylex':
/tmp//ccbB9856.o(.text+0x3e): In function `main':
/tmp//ccw10708.o(.text+0x5d): In function `main':
/tmp//cci28523.o(.text+0xde): In function `main':
libperl.a(perlio.o)(.text+0x55a4): In function `PerlIO_vsprintf':
libperl.a(toke.o)(.text+0x9ce7): In function `Perl_yylex':
lib/auto/DynaLoader/DynaLoader.a(DynaLoader.o)(.text+0x52e): In function `XS_DynaLoader_dl_load_file':
util.o(.text+0x283): In function `savestr':
str.o(.text+0x81): In function `str_2ptr':
../libperl.a(perlio.o)(.text+0x55a4): In function `PerlIO_vsprintf':
../libperl.a(toke.o)(.text+0x9ce7): In function `Perl_yylex':
/tmp//ccG14531.o(.text+0x3e): In function `main':
/tmp//ccCK1071.o(.text+0x5d): In function `main':
/tmp//ccf25420.o(.text+0xde): In function `main':
libperl.a(perlio.o)(.text+0x540c): In function `PerlIO_vsprintf':
libperl.a(toke.o)(.text+0x7912): In function `Perl_yylex':
../libperl.a(perlio.o)(.text+0x540c): In function `PerlIO_vsprintf':
../libperl.a(toke.o)(.text+0x7912): In function `Perl_yylex':
/tmp//ccCQ7024.o(.text+0x3e): In function `main':
/tmp//ccP12893.o(.text+0x5d): In function `main':
/tmp//ccv13069.o(.text+0xde): In function `main':
libperl.a(perlio.o)(.text+0x59c0): In function `PerlIO_vsprintf':
libperl.a(toke.o)(.text+0x9dd7): In function `Perl_yylex':
lib/auto/DynaLoader/DynaLoader.a(DynaLoader.o)(.text+0x532): In function `XS_DynaLoader_dl_load_file':
../libperl.a(perlio.o)(.text+0x59c0): In function `PerlIO_vsprintf':
../libperl.a(toke.o)(.text+0x9dd7): In function `Perl_yylex':
/tmp//ccX28386.o(.text+0x3e): In function `main':
/tmp//ccf32482.o(.text+0x5d): In function `main':
/tmp//ccFQ3602.o(.text+0xde): In function `main':
gv.c:558: warning: null argument where non-null required (arg 3)
gv.c:1260: warning: null argument where non-null required (arg 3)
pp_hot.c:2763: warning: null argument where non-null required (arg 3)
sv.c: In function `Perl_sv_dup':
sv.c:9765: warning: comparison is always false due to limited range of data type
pp.c:363: warning: null argument where non-null required (arg 3)
pp_ctl.c:2308: warning: null argument where non-null required (arg 3)
pp_sys.c:1172: warning: null argument where non-null required (arg 3)
libperl.a(perlio.o)(.text+0x124): In function `PerlIO_debug':
opmini.o(.text+0x384): In function `Perl_allocmy':
libperl.a(toke.o)(.text+0x8348): In function `Perl_yylex':
libperl.a(op.o)(.text+0x384): In function `Perl_allocmy':
lib/auto/DynaLoader/DynaLoader.a(DynaLoader.o)(.text+0x276): In function `XS_DynaLoader_dl_load_file':
../libperl.a(perlio.o)(.text+0x124): In function `PerlIO_debug':
../libperl.a(op.o)(.text+0x384): In function `Perl_allocmy':
../libperl.a(toke.o)(.text+0x8348): In function `Perl_yylex':
/tmp//ccBLU652.o(.text+0x3e): In function `main':
/tmp//ccs10665.o(.text+0x5d): In function `main':
/tmp//cclj2105.o(.text+0xde): In function `main':
libperl.a(toke.o)(.text+0xa876): In function `Perl_yylex':
lib/auto/DynaLoader/DynaLoader.a(DynaLoader.o)(.text+0x59a): In function `XS_DynaLoader_dl_load_file':
../libperl.a(toke.o)(.text+0xa876): In function `Perl_yylex':
/tmp//ccfA5188.o(.text+0x3e): In function `main':
/tmp//ccI13948.o(.text+0x5d): In function `main':
/tmp//ccZY1294.o(.text+0xde): In function `main':
libperl.a(perlio.o)(.text+0x12a): In function `PerlIO_debug':
libperl.a(toke.o)(.text+0x8454): In function `Perl_yylex':
lib/auto/DynaLoader/DynaLoader.a(DynaLoader.o)(.text+0x27a): In function `XS_DynaLoader_dl_load_file':
../libperl.a(perlio.o)(.text+0x12a): In function `PerlIO_debug':
../libperl.a(toke.o)(.text+0x8454): In function `Perl_yylex':
/tmp//ccQh9224.o(.text+0x3e): In function `main':
/tmp//ccp19861.o(.text+0x5d): In function `main':
/tmp//ccx19912.o(.text+0xde): In function `main':
libperl.a(toke.o)(.text+0xa962): In function `Perl_yylex':
lib/auto/DynaLoader/DynaLoader.a(DynaLoader.o)(.text+0x59e): In function `XS_DynaLoader_dl_load_file':
../libperl.a(toke.o)(.text+0xa962): In function `Perl_yylex':

-- 
Report by Test::Smoke v1.19_71 build 874 running on perl 5.8.6
(Reporter v0.022 / Smoker v0.025)




nntp.perl.org: Perl Programming lists via nntp and http.
Comments to Ask Bjørn Hansen at ask@perl.org | Group listing | About