develooper Front page | perl.perl5.porters | Postings from February 2006

Smoke [5.9.4] 27322 FAIL(F) MSWin32 WinXP/.Net SP2 (x86/2 cpu)

From:
Steve Hay
Date:
February 25, 2006 04:41
Subject:
Smoke [5.9.4] 27322 FAIL(F) MSWin32 WinXP/.Net SP2 (x86/2 cpu)
Message ID:
200602251237.MAA27788@sockeye.uk.radan.com
Automated smoke report for 5.9.4 patch 27322
Mugwump.uk.radan.com:  Intel(R) Pentium(R) 4 CPU 3.40GHz(~3391 MHz) (x86/2 cpu)
    on        MSWin32 - WinXP/.Net SP2
    using     bcc32 version 5.5.1
    smoketime 12 hours 42 minutes (average 19 minutes 3 seconds)

Summary: FAIL(F)

O = OK  F = Failure(s), extended report at the bottom
X = Failure(s) under TEST but not under harness
? = still running or test results not (yet) available
Build failures during:       - = unknown or N/A
c = Configure, m = make, M = make (after miniperl), t = make test-prep

   27322     Configuration (common) -DCCTYPE=BORLAND -DINST_TOP=$(INST_DRV)\Smoke\doesntexist
----------- ---------------------------------------------------------
F F         
F F         -Dusemymalloc
F F         -Duselargefiles
F F         -Duselargefiles -Dusemymalloc
F F         -Duseithreads -Uuseimpsys
F F         -Duseithreads -Uuseimpsys -Dusemymalloc
F F         -Duseithreads -Uuseimpsys -Duselargefiles
F F         -Duseithreads -Uuseimpsys -Duselargefiles -Dusemymalloc
F F         -Duseithreads
F F         -Duseithreads -Duselargefiles
F F         -Accflags='-DPERL_COPY_ON_WRITE'
F F         -Accflags='-DPERL_COPY_ON_WRITE' -Dusemymalloc
F F         -Accflags='-DPERL_COPY_ON_WRITE' -Duselargefiles
F F         -Accflags='-DPERL_COPY_ON_WRITE' -Duselargefiles -Dusemymalloc
F F         -Accflags='-DPERL_COPY_ON_WRITE' -Duseithreads -Uuseimpsys
F F         -Accflags='-DPERL_COPY_ON_WRITE' -Duseithreads -Uuseimpsys -Dusemymalloc
F F         -Accflags='-DPERL_COPY_ON_WRITE' -Duseithreads -Uuseimpsys -Duselargefiles
F F         -Accflags='-DPERL_COPY_ON_WRITE' -Duseithreads -Uuseimpsys -Duselargefiles -Dusemymalloc
F F         -Accflags='-DPERL_COPY_ON_WRITE' -Duseithreads
F F         -Accflags='-DPERL_COPY_ON_WRITE' -Duseithreads -Duselargefiles
| +--------- -DDEBUGGING
+----------- no debugging


Failures: (common-args) -DCCTYPE=BORLAND -DINST_TOP=$(INST_DRV)\Smoke\doesntexist
[default] 
[default] -DDEBUGGING
[default] -Duselargefiles
[default] -DDEBUGGING -Duselargefiles
[default] -Duseithreads -Uuseimpsys
[default] -DDEBUGGING -Duseithreads -Uuseimpsys
[default] -Duseithreads -Uuseimpsys -Duselargefiles
[default] -DDEBUGGING -Duseithreads -Uuseimpsys -Duselargefiles
[default] -Accflags='-DPERL_COPY_ON_WRITE'
[default] -DDEBUGGING -Accflags='-DPERL_COPY_ON_WRITE'
[default] -Accflags='-DPERL_COPY_ON_WRITE' -Duselargefiles
[default] -DDEBUGGING -Accflags='-DPERL_COPY_ON_WRITE' -Duselargefiles
[default] -Accflags='-DPERL_COPY_ON_WRITE' -Duseithreads -Uuseimpsys
[default] -DDEBUGGING -Accflags='-DPERL_COPY_ON_WRITE' -Duseithreads -Uuseimpsys
[default] -Accflags='-DPERL_COPY_ON_WRITE' -Duseithreads -Uuseimpsys -Duselargefiles
[default] -DDEBUGGING -Accflags='-DPERL_COPY_ON_WRITE' -Duseithreads -Uuseimpsys -Duselargefiles
    ../lib/locale.t.........................FAILED 99-103
    op/utftaint.t...........................FAILED 87-88

[default] -Dusemymalloc
[default] -DDEBUGGING -Dusemymalloc
[default] -Duselargefiles -Dusemymalloc
[default] -DDEBUGGING -Duselargefiles -Dusemymalloc
[default] -Duseithreads -Uuseimpsys -Dusemymalloc
[default] -DDEBUGGING -Duseithreads -Uuseimpsys -Dusemymalloc
[default] -Duseithreads -Uuseimpsys -Duselargefiles -Dusemymalloc
[default] -DDEBUGGING -Duseithreads -Uuseimpsys -Duselargefiles -Dusemymalloc
[default] -Duseithreads
[default] -DDEBUGGING -Duseithreads
[default] -Duseithreads -Duselargefiles
[default] -DDEBUGGING -Duseithreads -Duselargefiles
[default] -Accflags='-DPERL_COPY_ON_WRITE' -Dusemymalloc
[default] -DDEBUGGING -Accflags='-DPERL_COPY_ON_WRITE' -Dusemymalloc
[default] -Accflags='-DPERL_COPY_ON_WRITE' -Duselargefiles -Dusemymalloc
[default] -DDEBUGGING -Accflags='-DPERL_COPY_ON_WRITE' -Duselargefiles -Dusemymalloc
[default] -Accflags='-DPERL_COPY_ON_WRITE' -Duseithreads -Uuseimpsys -Dusemymalloc
[default] -DDEBUGGING -Accflags='-DPERL_COPY_ON_WRITE' -Duseithreads -Uuseimpsys -Dusemymalloc
[default] -Accflags='-DPERL_COPY_ON_WRITE' -Duseithreads -Uuseimpsys -Duselargefiles -Dusemymalloc
[default] -DDEBUGGING -Accflags='-DPERL_COPY_ON_WRITE' -Duseithreads -Uuseimpsys -Duselargefiles -Dusemymalloc
[default] -Accflags='-DPERL_COPY_ON_WRITE' -Duseithreads
[default] -DDEBUGGING -Accflags='-DPERL_COPY_ON_WRITE' -Duseithreads
[default] -DDEBUGGING -Accflags='-DPERL_COPY_ON_WRITE' -Duseithreads -Duselargefiles
    op/utftaint.t...........................FAILED 87-88

[default] -Accflags='-DPERL_COPY_ON_WRITE' -Duseithreads -Duselargefiles
    op/utftaint.t...........................FAILED 87-88
Inconsistent test results (between TEST and harness):
    ../lib/Benchmark.t......................dubious

Compiler messages(bcc32):
Warning W8068 ..\regcomp.c 1580: Constant out of range in comparison in function S_study_chunk
Warning W8068 ..\sv.c 1285: Constant out of range in comparison in function Perl_sv_upgrade
Warning W8068 ..\sv.c 1339: Constant out of range in comparison in function Perl_sv_upgrade
Warning W8068 ..\sv.c 1349: Constant out of range in comparison in function Perl_sv_upgrade
Warning W8065 win32.c 2051: Call to function 'win32_create_message_window' with no prototype in function win32_alarm
Warning W8004 fcrypt.c 348: 'in' is assigned a value that is never used in function des_set_key
Warning W8004 fcrypt.c 505: 'b' is assigned a value that is never used in function des_fcrypt
Warning W8065 .\win32.c 2051: Call to function 'win32_create_message_window' with no prototype in function win32_alarm
Warning W8055 .\win32io.c 259: Possible overflow in shift operation in function PerlIOWin32_seek
Warning W8055 .\win32io.c 280: Possible overflow in shift operation in function PerlIOWin32_tell
Warning W8004 .\fcrypt.c 348: 'in' is assigned a value that is never used in function des_set_key
Warning W8004 .\fcrypt.c 505: 'b' is assigned a value that is never used in function des_fcrypt
Warning W8068 byterun.c 893: Constant out of range in comparison in function byterun
Warning W8008 crc32.c 232: Condition is always true in function crc32
Warning W8066 crc32.c 242: Unreachable code in function crc32
Warning W8004 deflate.c 352: 'hash_head' is assigned a value that is never used in function deflateSetDictionary
Warning W8008 deflate.c 1278: Condition is always false in function fill_window
Warning W8066 deflate.c 1279: Unreachable code in function fill_window
Warning W8004 deflate.c 1669: 'bflush' is assigned a value that is never used in function deflate_slow
Warning W8065 .\src/sha.c 250: Call to function 'w32mem' with no prototype in function digcpy
Warning W8065 .\src/sha.c 253: Call to function 'w32mem' with no prototype in function digcpy
Warning W8065 .\src/sha.c 254: Call to function 'w32mem' with no prototype in function digcpy
Warning W8065 .\src/sha.c 293: Call to function 'sharewind' with no prototype in function shaopen
Warning W8064 .\src/sha.c 306: Call to function with no prototype in function shadirect
Warning W8064 .\src/sha.c 333: Call to function with no prototype in function shabytes
Warning W8065 .\src/sha.c 334: Call to function 'shadirect' with no prototype in function shabytes
Warning W8064 .\src/sha.c 365: Call to function with no prototype in function shabits
Warning W8065 .\src/sha.c 372: Call to function 'shabytes' with no prototype in function shabits
Warning W8065 .\src/sha.c 378: Call to function 'shabytes' with no prototype in function shabits
Warning W8065 .\src/sha.c 395: Call to function 'shadirect' with no prototype in function shawrite
Warning W8065 .\src/sha.c 397: Call to function 'shabytes' with no prototype in function shawrite
Warning W8065 .\src/sha.c 399: Call to function 'shabits' with no prototype in function shawrite
Warning W8064 .\src/sha.c 416: Call to function with no prototype in function shafinish
Warning W8065 .\src/sha.c 420: Call to function 'w32mem' with no prototype in function shafinish
Warning W8065 .\src/sha.c 421: Call to function 'w32mem' with no prototype in function shafinish
Warning W8065 .\src/sha.c 423: Call to function 'w32mem' with no prototype in function shafinish
Warning W8065 .\src/sha.c 424: Call to function 'w32mem' with no prototype in function shafinish
Warning W8064 .\src/sha.c 425: Call to function with no prototype in function shafinish
Warning W8065 .\src/sha.c 432: Call to function 'digcpy' with no prototype in function shadigest
Warning W8065 .\src/sha.c 442: Call to function 'digcpy' with no prototype in function shahex
Warning W8065 .\src/sha.c 482: Call to function 'digcpy' with no prototype in function shabase64
Warning W8065 .\src/sha.c 487: Call to function 'encbase64' with no prototype in function shabase64
Warning W8065 .\src/sha.c 490: Call to function 'encbase64' with no prototype in function shabase64
Warning W8065 .\src/sha.c 522: Call to function 'shadigest' with no prototype in function shadump
Warning W8065 .\src/sha.c 611: Call to function 'fgetstr' with no prototype in function ldvals
Warning W8065 .\src/sha.c 612: Call to function 'empty' with no prototype in function ldvals
Warning W8065 .\src/sha.c 614: Call to function 'getval' with no prototype in function ldvals
Warning W8065 .\src/sha.c 617: Call to function 'getval' with no prototype in function ldvals
Warning W8065 .\src/sha.c 637: Call to function 'shaclose' with no prototype in function closeall
Warning W8065 .\src/sha.c 655: Call to function 'ldvals' with no prototype in function shaload
Warning W8065 .\src/sha.c 656: Call to function 'shaopen' with no prototype in function shaload
Warning W8065 .\src/sha.c 657: Call to function 'ldvals' with no prototype in function shaload
Warning W8065 .\src/sha.c 658: Call to function 'ldvals' with no prototype in function shaload
Warning W8065 .\src/sha.c 659: Call to function 'ldvals' with no prototype in function shaload
Warning W8065 .\src/sha.c 662: Call to function 'ldvals' with no prototype in function shaload
Warning W8065 .\src/sha.c 663: Call to function 'ldvals' with no prototype in function shaload
Warning W8065 .\src/sha.c 664: Call to function 'ldvals' with no prototype in function shaload
Warning W8065 .\src/sha.c 665: Call to function 'ldvals' with no prototype in function shaload
Warning W8065 .\src/sha.c 667: Call to function 'closeall' with no prototype in function shaload
Warning W8065 .\src/hmac.c 31: Call to function 'shaopen' with no prototype in function hmacopen
Warning W8065 .\src/hmac.c 35: Call to function 'shaopen' with no prototype in function hmacopen
Warning W8065 .\src/hmac.c 36: Call to function 'shaclose' with no prototype in function hmacopen
Warning W8065 .\src/hmac.c 43: Call to function 'shaopen' with no prototype in function hmacopen
Warning W8065 .\src/hmac.c 44: Call to function 'shaclose' with no prototype in function hmacopen
Warning W8065 .\src/hmac.c 45: Call to function 'shaclose' with no prototype in function hmacopen
Warning W8065 .\src/hmac.c 49: Call to function 'shawrite' with no prototype in function hmacopen
Warning W8065 .\src/hmac.c 50: Call to function 'shafinish' with no prototype in function hmacopen
Warning W8065 .\src/hmac.c 51: Call to function 'shadigest' with no prototype in function hmacopen
Warning W8065 .\src/hmac.c 52: Call to function 'shaclose' with no prototype in function hmacopen
Warning W8065 .\src/hmac.c 56: Call to function 'shawrite' with no prototype in function hmacopen
Warning W8065 .\src/hmac.c 59: Call to function 'shawrite' with no prototype in function hmacopen
Warning W8065 .\src/hmac.c 70: Call to function 'shawrite' with no prototype in function hmacwrite
Warning W8065 .\src/hmac.c 77: Call to function 'shafinish' with no prototype in function hmacfinish
Warning W8065 .\src/hmac.c 78: Call to function 'shadigest' with no prototype in function hmacfinish
Warning W8065 .\src/hmac.c 78: Call to function 'shawrite' with no prototype in function hmacfinish
Warning W8065 .\src/hmac.c 79: Call to function 'shaclose' with no prototype in function hmacfinish
Warning W8065 .\src/hmac.c 80: Call to function 'shafinish' with no prototype in function hmacfinish
Warning W8065 .\src/hmac.c 87: Call to function 'shadigest' with no prototype in function hmacdigest
Warning W8065 .\src/hmac.c 94: Call to function 'shahex' with no prototype in function hmachex
Warning W8065 .\src/hmac.c 101: Call to function 'shabase64' with no prototype in function hmacbase64
Warning W8065 .\src/hmac.c 108: Call to function 'shaclose' with no prototype in function hmacclose
Warning W8065 SHA.c 53: Call to function 'shaclose' with no prototype in function XS_Digest__SHA_shaclose
Warning W8065 SHA.c 84: Call to function 'shadump' with no prototype in function XS_Digest__SHA_shadump
Warning W8065 SHA.c 113: Call to function 'shadup' with no prototype in function XS_Digest__SHA_shadup
Warning W8065 SHA.c 136: Call to function 'shaload' with no prototype in function XS_Digest__SHA_shaload
Warning W8065 SHA.c 159: Call to function 'shaopen' with no prototype in function XS_Digest__SHA_shaopen
Warning W8065 SHA.c 188: Call to function 'sharewind' with no prototype in function XS_Digest__SHA_sharewind
Warning W8065 SHA.c 219: Call to function 'shawrite' with no prototype in function XS_Digest__SHA_shawrite
Warning W8065 SHA.xs 76: Call to function 'shaopen' with no prototype in function XS_Digest__SHA_sha1
Warning W8065 SHA.xs 80: Call to function 'shawrite' with no prototype in function XS_Digest__SHA_sha1
Warning W8065 SHA.xs 82: Call to function 'shafinish' with no prototype in function XS_Digest__SHA_sha1
Warning W8065 SHA.xs 85: Call to function 'shadigest' with no prototype in function XS_Digest__SHA_sha1
Warning W8065 SHA.xs 86: Call to function 'shadsize' with no prototype in function XS_Digest__SHA_sha1
Warning W8065 SHA.xs 89: Call to function 'shahex' with no prototype in function XS_Digest__SHA_sha1
Warning W8065 SHA.xs 91: Call to function 'shabase64' with no prototype in function XS_Digest__SHA_sha1
Warning W8065 SHA.xs 93: Call to function 'shaclose' with no prototype in function XS_Digest__SHA_sha1
Warning W8065 SHA.xs 123: Call to function 'hmacopen' with no prototype in function XS_Digest__SHA_hmac_sha1
Warning W8065 SHA.xs 127: Call to function 'hmacwrite' with no prototype in function XS_Digest__SHA_hmac_sha1
Warning W8065 SHA.xs 129: Call to function 'hmacfinish' with no prototype in function XS_Digest__SHA_hmac_sha1
Warning W8065 SHA.xs 132: Call to function 'hmacdigest' with no prototype in function XS_Digest__SHA_hmac_sha1
Warning W8065 SHA.xs 133: Call to function 'shadsize' with no prototype in function XS_Digest__SHA_hmac_sha1
Warning W8065 SHA.xs 136: Call to function 'hmachex' with no prototype in function XS_Digest__SHA_hmac_sha1
Warning W8065 SHA.xs 138: Call to function 'hmacbase64' with no prototype in function XS_Digest__SHA_hmac_sha1
Warning W8065 SHA.xs 140: Call to function 'hmacclose' with no prototype in function XS_Digest__SHA_hmac_sha1
Warning W8065 SHA.xs 154: Call to function 'shadsize' with no prototype in function XS_Digest__SHA_hashsize
Warning W8065 SHA.xs 172: Call to function 'shawrite' with no prototype in function XS_Digest__SHA_add
Warning W8065 SHA.xs 189: Call to function 'shafinish' with no prototype in function XS_Digest__SHA_digest
Warning W8065 SHA.xs 192: Call to function 'shadigest' with no prototype in function XS_Digest__SHA_digest
Warning W8065 SHA.xs 193: Call to function 'shadsize' with no prototype in function XS_Digest__SHA_digest
Warning W8065 SHA.xs 196: Call to function 'shahex' with no prototype in function XS_Digest__SHA_digest
Warning W8065 SHA.xs 198: Call to function 'shabase64' with no prototype in function XS_Digest__SHA_digest
Warning W8065 SHA.xs 200: Call to function 'sharewind' with no prototype in function XS_Digest__SHA_digest
Warning W8019 SDBM_File.c 141: Code has no effect in function XS_SDBM_File_FETCH
Warning W8019 SDBM_File.c 148: Code has no effect in function XS_SDBM_File_FETCH
Warning W8019 SDBM_File.c 180: Code has no effect in function XS_SDBM_File_STORE
Warning W8019 SDBM_File.c 184: Code has no effect in function XS_SDBM_File_STORE
Warning W8019 SDBM_File.c 240: Code has no effect in function XS_SDBM_File_DELETE
Warning W8019 SDBM_File.c 275: Code has no effect in function XS_SDBM_File_EXISTS
Warning W8019 SDBM_File.c 311: Code has no effect in function XS_SDBM_File_FIRSTKEY
Warning W8019 SDBM_File.c 340: Code has no effect in function XS_SDBM_File_NEXTKEY
Warning W8019 SDBM_File.c 347: Code has no effect in function XS_SDBM_File_NEXTKEY
Warning W8065 APItest.xs 495: Call to function 'my_cxt_getsv_interp' with no prototype in function XS_XS__APItest_my_cxt_getsv
Warning W8068 re_comp.c 1580: Constant out of range in comparison in function S_study_chunk
Warning W8064 Win32.xs 368: Call to function with no prototype in function w32_RegisterServer
Warning W8064 Win32.xs 389: Call to function with no prototype in function w32_UnregisterServer
Warning W8055 .\win32.c 2637: Possible overflow in shift operation in function win32_fstat
Warning W8068 ..\sv.c 9770: Constant out of range in comparison in function Perl_sv_dup
Warning W8027 vdir.h 37: Functions containing while are not expanded inline
Warning W8027 vdir.h 47: Functions containing while are not expanded inline
Warning W8027 vdir.h 299: Functions containing switch are not expanded inline
Warning W8027 vdir.h 527: Functions containing switch are not expanded inline
Warning W8079 perlhost.h 616: Mixing pointers to different 'char' types in function PerlStdIOGetBase(IPerlStdIO *,FILE *)
Warning W8079 perlhost.h 649: Mixing pointers to different 'char' types in function PerlStdIOGetPtr(IPerlStdIO *,FILE *)
Warning W8079 perlhost.h 741: Mixing pointers to different 'char' types in function PerlStdIOSetPtr(IPerlStdIO *,FILE *,char *)

-- 
Report by Test::Smoke v1.19_72 build 895 running on perl v5.9.3
(Reporter v0.026 / Smoker v0.026)



------------------------------------------------
Radan Computational Ltd.

The information contained in this message and any files transmitted with it are confidential and intended for the addressee(s) only. If you have received this message in error or there are any problems, please notify the sender immediately. The unauthorized use, disclosure, copying or alteration of this message is strictly forbidden. Note that any views or opinions presented in this email are solely those of the author and do not necessarily represent those of Radan Computational Ltd. The recipient(s) of this message should check it and any attached files for viruses: Radan Computational will accept no liability for any damage caused by any virus transmitted by this email.



nntp.perl.org: Perl Programming lists via nntp and http.
Comments to Ask Bjørn Hansen at ask@perl.org | Group listing | About