develooper Front page | perl.perl5.porters | Postings from February 2006

Smoke [5.9.4] 27265 FAIL(F) MSWin32 WinXP/.Net SP2 (x86/2 cpu)

Thread Next
From:
Steve Hay
Date:
February 22, 2006 07:10
Subject:
Smoke [5.9.4] 27265 FAIL(F) MSWin32 WinXP/.Net SP2 (x86/2 cpu)
Message ID:
200602221506.PAA01764@sockeye.uk.radan.com
Automated smoke report for 5.9.4 patch 27265
Mugwump.uk.radan.com:  Intel(R) Pentium(R) 4 CPU 3.40GHz(~3391 MHz) (x86/2 cpu)
    on        MSWin32 - WinXP/.Net SP2
    using     cl version 12.00.8804
    smoketime 15 hours 38 minutes (average 23 minutes 28 seconds)

Summary: FAIL(F)

O = OK  F = Failure(s), extended report at the bottom
X = Failure(s) under TEST but not under harness
? = still running or test results not (yet) available
Build failures during:       - = unknown or N/A
c = Configure, m = make, M = make (after miniperl), t = make test-prep

   27265     Configuration (common) -DINST_TOP=$(INST_DRV)\Smoke\doesntexist
----------- ---------------------------------------------------------
O O         
O O         -Dusemymalloc
O O         -Duselargefiles
O O         -Duselargefiles -Dusemymalloc
O O         -Duseithreads -Uuseimpsys
O O         -Duseithreads -Uuseimpsys -Dusemymalloc
O O         -Duseithreads -Uuseimpsys -Duselargefiles
O O         -Duseithreads -Uuseimpsys -Duselargefiles -Dusemymalloc
F F         -Duseithreads
F F         -Duseithreads -Duselargefiles
O O         -Accflags='-DPERL_COPY_ON_WRITE'
O O         -Accflags='-DPERL_COPY_ON_WRITE' -Dusemymalloc
O O         -Accflags='-DPERL_COPY_ON_WRITE' -Duselargefiles
O O         -Accflags='-DPERL_COPY_ON_WRITE' -Duselargefiles -Dusemymalloc
O O         -Accflags='-DPERL_COPY_ON_WRITE' -Duseithreads -Uuseimpsys
O O         -Accflags='-DPERL_COPY_ON_WRITE' -Duseithreads -Uuseimpsys -Dusemymalloc
O O         -Accflags='-DPERL_COPY_ON_WRITE' -Duseithreads -Uuseimpsys -Duselargefiles
O O         -Accflags='-DPERL_COPY_ON_WRITE' -Duseithreads -Uuseimpsys -Duselargefiles -Dusemymalloc
F F         -Accflags='-DPERL_COPY_ON_WRITE' -Duseithreads
F F         -Accflags='-DPERL_COPY_ON_WRITE' -Duseithreads -Duselargefiles
| +--------- -DDEBUGGING
+----------- no debugging


Failures: (common-args) -DINST_TOP=$(INST_DRV)\Smoke\doesntexist
[default] -Duseithreads
[default] -Accflags='-DPERL_COPY_ON_WRITE' -Duseithreads
[default] -Accflags='-DPERL_COPY_ON_WRITE' -Duseithreads -Duselargefiles
    ../ext/Socket/t/socketpair.t............FAILED ??
    ../ext/Storable/t/threads.t.............FAILED 1-2
    ../ext/XS/APItest/t/my_cxt.t............FAILED 6-11
    ../ext/threads/shared/t/av_refs.t.......FAILED 4-11
    ../ext/threads/shared/t/blessed.t.......FAILED 1-36
    ../ext/threads/shared/t/cond.t..........FAILED 2-31
    ../ext/threads/shared/t/hv_refs.t.......FAILED 4-17
    ../ext/threads/shared/t/sv_refs.t.......FAILED 7-10
    ../ext/threads/shared/t/wait.t..........FAILED 6-102
    ../ext/threads/t/basic.t................FAILED 2-19
    ../ext/threads/t/end.t..................FAILED 2-6
    ../ext/threads/t/join.t.................FAILED 2-14
    ../ext/threads/t/libc.t.................FAILED 1-11
    ../ext/threads/t/list.t.................FAILED 3-8
    ../ext/threads/t/problems.t.............FAILED 1-14
    ../ext/threads/t/stress_cv.t............FAILED 4-64
    ../ext/threads/t/stress_re.t............FAILED 4-64
    ../ext/threads/t/stress_string.t........FAILED 4-64
    ../ext/threads/t/thread.t...............FAILED 2-31
    ../lib/Test/Simple/t/fork.t.............FAILED 1
    ../lib/Test/Simple/t/sort_bug.t.........FAILED 1-2
    ../lib/Test/Simple/t/threads.t..........FAILED 1-6
    ../lib/Thread/Queue.t...................FAILED 1-26
    op/fork.t...............................FAILED 1-20
    op/threads.t............................FAILED 1-4
    op/utftaint.t...........................FAILED 87-88
Inconsistent test results (between TEST and harness):
    ../ext/threads/shared/t/no_share.t......dubious
    ../ext/threads/shared/t/av_simple.t.....dubious
    ../ext/threads/shared/t/hv_simple.t.....dubious
    ../ext/threads/shared/t/shared_attr.t...dubious
    ../ext/threads/shared/t/sv_simple.t.....dubious

[default] -DDEBUGGING -Duseithreads
    ../ext/Socket/t/socketpair.t............FAILED ??
    ../ext/Storable/t/threads.t.............FAILED 1-2
    ../ext/XS/APItest/t/my_cxt.t............FAILED 6-11
    ../ext/threads/shared/t/av_refs.t.......FAILED 4-11
    ../ext/threads/shared/t/blessed.t.......FAILED 1-36
    ../ext/threads/shared/t/cond.t..........FAILED 2-31
    ../ext/threads/shared/t/hv_refs.t.......FAILED 4-17
    ../ext/threads/shared/t/sv_refs.t.......FAILED 7-10
    ../ext/threads/shared/t/wait.t..........FAILED 6-102
    ../ext/threads/t/basic.t................FAILED 2-19
    ../ext/threads/t/end.t..................FAILED 2-6
    ../ext/threads/t/join.t.................FAILED 2-14
    ../ext/threads/t/libc.t.................FAILED 1-11
    ../ext/threads/t/list.t.................FAILED 3-8
    ../ext/threads/t/problems.t.............FAILED 1-14
    ../ext/threads/t/stress_cv.t............FAILED 4-64
    ../ext/threads/t/stress_re.t............FAILED 4-64
    ../ext/threads/t/stress_string.t........FAILED 4-64
    ../ext/threads/t/thread.t...............FAILED 2-31
    ../lib/Test/Simple/t/fork.t.............FAILED 1
    ../lib/Test/Simple/t/sort_bug.t.........FAILED 1-2
    ../lib/Test/Simple/t/threads.t..........FAILED 1-6
    ../lib/Thread/Queue.t...................FAILED 1-26
    op/fork.t...............................FAILED 1-7 9-20
    op/threads.t............................FAILED 1-4
    op/utftaint.t...........................FAILED 87-88
Inconsistent test results (between TEST and harness):
    ../ext/threads/shared/t/no_share.t......dubious
    ../ext/threads/shared/t/av_simple.t.....dubious
    ../ext/threads/shared/t/hv_simple.t.....dubious
    ../ext/threads/shared/t/shared_attr.t...dubious
    ../ext/threads/shared/t/sv_simple.t.....dubious

[default] -Duseithreads -Duselargefiles
    ../ext/Devel/DProf/t/DProf.t............FAILED 13-16
    ../ext/Socket/t/socketpair.t............FAILED ??
    ../ext/Storable/t/threads.t.............FAILED 1-2
    ../ext/XS/APItest/t/my_cxt.t............FAILED 6-11
    ../ext/threads/shared/t/av_refs.t.......FAILED 4-11
    ../ext/threads/shared/t/blessed.t.......FAILED 1-36
    ../ext/threads/shared/t/cond.t..........FAILED 2-31
    ../ext/threads/shared/t/hv_refs.t.......FAILED 4-17
    ../ext/threads/shared/t/sv_refs.t.......FAILED 7-10
    ../ext/threads/shared/t/wait.t..........FAILED 6-102
    ../ext/threads/t/basic.t................FAILED 2-19
    ../ext/threads/t/end.t..................FAILED 2-6
    ../ext/threads/t/join.t.................FAILED 2-14
    ../ext/threads/t/libc.t.................FAILED 1-11
    ../ext/threads/t/list.t.................FAILED 3-8
    ../ext/threads/t/problems.t.............FAILED 1-14
    ../ext/threads/t/stress_cv.t............FAILED 4-64
    ../ext/threads/t/stress_re.t............FAILED 4-64
    ../ext/threads/t/stress_string.t........FAILED 4-64
    ../ext/threads/t/thread.t...............FAILED 2-31
    ../lib/Test/Simple/t/fork.t.............FAILED 1
    ../lib/Test/Simple/t/sort_bug.t.........FAILED 1-2
    ../lib/Test/Simple/t/threads.t..........FAILED 1-6
    ../lib/Thread/Queue.t...................FAILED 1-26
    op/fork.t...............................FAILED 1-20
    op/threads.t............................FAILED 1-4
    op/utftaint.t...........................FAILED 87-88
Inconsistent test results (between TEST and harness):
    ../ext/threads/shared/t/no_share.t......dubious
    ../ext/threads/shared/t/av_simple.t.....dubious
    ../ext/threads/shared/t/hv_simple.t.....dubious
    ../ext/threads/shared/t/shared_attr.t...dubious
    ../ext/threads/shared/t/sv_simple.t.....dubious

[default] -DDEBUGGING -Duseithreads -Duselargefiles
    ../ext/Devel/DProf/t/DProf.t............FAILED 13-16
    ../ext/Socket/t/socketpair.t............FAILED ??
    ../ext/Storable/t/threads.t.............FAILED 1-2
    ../ext/XS/APItest/t/my_cxt.t............FAILED 6-11
    ../ext/threads/shared/t/av_refs.t.......FAILED 4-11
    ../ext/threads/shared/t/blessed.t.......FAILED 1-36
    ../ext/threads/shared/t/cond.t..........FAILED 2-31
    ../ext/threads/shared/t/hv_refs.t.......FAILED 4-17
    ../ext/threads/shared/t/sv_refs.t.......FAILED 7-10
    ../ext/threads/shared/t/wait.t..........FAILED 7-102
    ../ext/threads/t/basic.t................FAILED 2-19
    ../ext/threads/t/end.t..................FAILED 2-6
    ../ext/threads/t/join.t.................FAILED 2-14
    ../ext/threads/t/libc.t.................FAILED 1-11
    ../ext/threads/t/list.t.................FAILED 3-8
    ../ext/threads/t/problems.t.............FAILED 1-14
    ../ext/threads/t/stress_cv.t............FAILED 4-64
    ../ext/threads/t/stress_re.t............FAILED 4-64
    ../ext/threads/t/stress_string.t........FAILED 4-64
    ../ext/threads/t/thread.t...............FAILED 2-31
    ../lib/Test/Simple/t/fork.t.............FAILED 1
    ../lib/Test/Simple/t/sort_bug.t.........FAILED 1-2
    ../lib/Test/Simple/t/threads.t..........FAILED 1-6
    ../lib/Thread/Queue.t...................FAILED 1-26
    op/fork.t...............................FAILED 3 6-7 10 18-19
    op/threads.t............................FAILED 1-4
    op/utftaint.t...........................FAILED 87-88
Inconsistent test results (between TEST and harness):
    ../ext/threads/shared/t/no_share.t......dubious
    ../ext/threads/shared/t/av_simple.t.....dubious
    ../ext/threads/shared/t/hv_simple.t.....dubious
    ../ext/threads/shared/t/shared_attr.t...dubious
    ../ext/threads/shared/t/sv_simple.t.....dubious

[default] -DDEBUGGING -Accflags='-DPERL_COPY_ON_WRITE' -Duseithreads
    ../ext/Devel/DProf/t/DProf.t............FAILED 13-16
    ../ext/Socket/t/socketpair.t............FAILED ??
    ../ext/Storable/t/threads.t.............FAILED 1-2
    ../ext/XS/APItest/t/my_cxt.t............FAILED 6-11
    ../ext/threads/shared/t/av_refs.t.......FAILED 4-11
    ../ext/threads/shared/t/blessed.t.......FAILED 1-36
    ../ext/threads/shared/t/cond.t..........FAILED 2-31
    ../ext/threads/shared/t/hv_refs.t.......FAILED 4-17
    ../ext/threads/shared/t/sv_refs.t.......FAILED 7-10
    ../ext/threads/shared/t/wait.t..........FAILED 7-102
    ../ext/threads/t/basic.t................FAILED 2-19
    ../ext/threads/t/end.t..................FAILED 2-6
    ../ext/threads/t/join.t.................FAILED 2-14
    ../ext/threads/t/libc.t.................FAILED 1-11
    ../ext/threads/t/list.t.................FAILED 3-8
    ../ext/threads/t/problems.t.............FAILED 1-14
    ../ext/threads/t/stress_cv.t............FAILED 4-64
    ../ext/threads/t/stress_re.t............FAILED 4-64
    ../ext/threads/t/stress_string.t........FAILED 4-64
    ../ext/threads/t/thread.t...............FAILED 2-31
    ../lib/Test/Simple/t/fork.t.............FAILED 1
    ../lib/Test/Simple/t/sort_bug.t.........FAILED 1-2
    ../lib/Test/Simple/t/threads.t..........FAILED 1-6
    ../lib/Thread/Queue.t...................FAILED 1-26
    op/fork.t...............................FAILED 1-7 9-20
    op/threads.t............................FAILED 1-4
    op/utftaint.t...........................FAILED 87-88
Inconsistent test results (between TEST and harness):
    ../ext/threads/shared/t/no_share.t......dubious
    ../ext/threads/shared/t/av_simple.t.....dubious
    ../ext/threads/shared/t/hv_simple.t.....dubious
    ../ext/threads/shared/t/shared_attr.t...dubious
    ../ext/threads/shared/t/sv_simple.t.....dubious

[default] -DDEBUGGING -Accflags='-DPERL_COPY_ON_WRITE' -Duseithreads -Duselargefiles
    ../ext/Devel/DProf/t/DProf.t............FAILED 13-16
    ../ext/Socket/t/socketpair.t............FAILED ??
    ../ext/Storable/t/threads.t.............FAILED 1-2
    ../ext/XS/APItest/t/my_cxt.t............FAILED 6-11
    ../ext/threads/shared/t/av_refs.t.......FAILED 4-11
    ../ext/threads/shared/t/blessed.t.......FAILED 1-36
    ../ext/threads/shared/t/cond.t..........FAILED 2-31
    ../ext/threads/shared/t/hv_refs.t.......FAILED 4-17
    ../ext/threads/shared/t/sv_refs.t.......FAILED 7-10
    ../ext/threads/shared/t/wait.t..........FAILED 6-102
    ../ext/threads/t/basic.t................FAILED 2-19
    ../ext/threads/t/end.t..................FAILED 2-6
    ../ext/threads/t/join.t.................FAILED 2-14
    ../ext/threads/t/libc.t.................FAILED 1-11
    ../ext/threads/t/list.t.................FAILED 3-8
    ../ext/threads/t/problems.t.............FAILED 1-14
    ../ext/threads/t/stress_cv.t............FAILED 4-64
    ../ext/threads/t/stress_re.t............FAILED 4-64
    ../ext/threads/t/stress_string.t........FAILED 4-64
    ../ext/threads/t/thread.t...............FAILED 2-31
    ../lib/Test/Simple/t/fork.t.............FAILED 1
    ../lib/Test/Simple/t/sort_bug.t.........FAILED 1-2
    ../lib/Test/Simple/t/threads.t..........FAILED 1-6
    ../lib/Thread/Queue.t...................FAILED 1-26
    op/fork.t...............................FAILED 3 6-7 10 13
    op/threads.t............................FAILED 1-4
    op/utftaint.t...........................FAILED 87-88
Inconsistent test results (between TEST and harness):
    ../ext/threads/shared/t/no_share.t......dubious
    ../ext/threads/shared/t/av_simple.t.....dubious
    ../ext/threads/shared/t/hv_simple.t.....dubious
    ../ext/threads/shared/t/shared_attr.t...dubious
    ../ext/threads/shared/t/sv_simple.t.....dubious

Compiler messages(MSWin32):
LINK : warning LNK4089: all references to "SHELL32.dll" discarded by /OPT:REF
.\src/sha.c(530) : warning C4018: '<' : signed/unsigned mismatch
FastCalc.xs(397) : warning C4244: 'function' : conversion from 'double ' to 'long ', possible loss of data
FastCalc.xs(399) : warning C4244: '+=' : conversion from 'double ' to 'unsigned int ', possible loss of data

-- 
Report by Test::Smoke v1.19_72 build 895 running on perl v5.9.3
(Reporter v0.026 / Smoker v0.026)



------------------------------------------------
Radan Computational Ltd.

The information contained in this message and any files transmitted with it are confidential and intended for the addressee(s) only. If you have received this message in error or there are any problems, please notify the sender immediately. The unauthorized use, disclosure, copying or alteration of this message is strictly forbidden. Note that any views or opinions presented in this email are solely those of the author and do not necessarily represent those of Radan Computational Ltd. The recipient(s) of this message should check it and any attached files for viruses: Radan Computational will accept no liability for any damage caused by any virus transmitted by this email.

Thread Next


nntp.perl.org: Perl Programming lists via nntp and http.
Comments to Ask Bjørn Hansen at ask@perl.org | Group listing | About