develooper Front page | perl.perl5.porters | Postings from October 2005

segfaults in recent maint builds on cygwin

Thread Next
From:
Yitzchak Scott-Thoennes
Date:
October 9, 2005 11:55
Subject:
segfaults in recent maint builds on cygwin
Message ID:
20051009185501.GA5948@efn.org
With 25673 and later I'm seeing:

t/run/exit................................ok
t/run/fresh_perl..........................sh: line 1:  3924 Segmentation fault      (core dumped) /home/sthoenna/bleadperl/mp/perl "-I../lib" "misctmp001" 2>&1
ok
t/run/noswitch............................ok
 ...
ext/threads/shared/t/av_refs..............ok
ext/threads/shared/t/av_simple............FAILED--expected 43 tests, saw 9
ext/threads/shared/t/cond.................ok
 ...
lib/ExtUtils/t/Command....................ok
lib/ExtUtils/t/Constant.................../bin/sh: line 1:  3460 Segmentation fault      (core dumped) ../../../perl.exe "-I../../../lib" "-I../../../lib" ../../../lib/ExtUtils/xsubpp -typemap ../../../lib/ExtUtils/typemap ExtTest.xs >ExtTest.xsc
make[1]: *** [ExtTest.c] Error 139
FAILED at test 3

Last build this didn't happen on was 25661, so 25668 could be the culprit.
Also not happening with blead builds.

Between 25661 and 25673 I also switched from the 20050929 cygwin snapshot
to the 20050930.  I'll try to rule that out.

Thread Next


nntp.perl.org: Perl Programming lists via nntp and http.
Comments to Ask Bjørn Hansen at ask@perl.org | Group listing | About