develooper Front page | perl.perl5.porters | Postings from October 2005

Smoke [5.9.3] 25712 FAIL(F) linux 2.6.12-9-686 [debian] (i686/1 cpu)

From:
steve
Date:
October 8, 2005 21:08
Subject:
Smoke [5.9.3] 25712 FAIL(F) linux 2.6.12-9-686 [debian] (i686/1 cpu)
Message ID:
20051009040805.BEFE7995CC@localhost.localdomain
Automated smoke report for 5.9.3 patch 25712
kirk: Intel(R) Celeron(R) CPU 2.00GHz (GenuineIntel 1994MHz) (i686/1 cpu)
    on        linux - 2.6.12-9-686 [debian]
    using     cc version 4.0.2 20050808 (prerelease) (Ubuntu 4.0.1-4ubuntu9)
    smoketime 12 hours 37 minutes (average 47 minutes 22 seconds)

Summary: FAIL(F)

O = OK  F = Failure(s), extended report at the bottom
X = Failure(s) under TEST but not under harness
? = still running or test results not (yet) available
Build failures during:       - = unknown or N/A
c = Configure, m = make, M = make (after miniperl), t = make test-prep

   25712     Configuration (common) none
----------- ---------------------------------------------------------
O O F O O F -DPERL_DEBUG_COW -DPERL_USE_SAFE_PUTENV
O O F O O F -DPERL_DEBUG_COW
O O F O O F -DPERL_DEBUG_COW -Duseithreads -DPERL_USE_SAFE_PUTENV
O O F O O F -DPERL_DEBUG_COW -Duseithreads
O O F O O F -DPERL_USE_SAFE_PUTENV
O O F O O F 
O O F O O F -Duseithreads -DPERL_USE_SAFE_PUTENV
O O F O O F -Duseithreads
| | | | | +- LC_ALL = en_US.utf8 -DDEBUGGING
| | | | +--- PERLIO = perlio -DDEBUGGING
| | | +----- PERLIO = stdio  -DDEBUGGING
| | +------- LC_ALL = en_US.utf8
| +--------- PERLIO = perlio
+----------- PERLIO = stdio


Failures:
[en_US.utf8] -DPERL_DEBUG_COW -DPERL_USE_SAFE_PUTENV
    ../ext/Compress/Zlib/t/04def.t..........FAILED 111-1775
    ../ext/Compress/Zlib/t/14gzopen.t.......FAILED 129 133 140
                                                   144 151 155
                                                   1696 1698-1700
                                                   1702 1708
                                                   1710-1712 1714
                                                   1777-2526
Inconsistent test results (between TEST and harness):
    ../ext/Compress/Zlib/t/16oneshot.t......FAILED at test 1622
    ../ext/Compress/Zlib/t/05examples.t.....FAILED at test 10

[en_US.utf8] -DDEBUGGING -DPERL_DEBUG_COW -DPERL_USE_SAFE_PUTENV
    ../ext/Compress/Zlib/t/04def.t..........FAILED 111-1775
    ../ext/Compress/Zlib/t/14gzopen.t.......FAILED 129 133 140
                                                   144 151 155
                                                   1696 1698-1700
                                                   1702-1703 1708
                                                   1710-1712
                                                   1714-1715 1780
                                                   1835-2526
Inconsistent test results (between TEST and harness):
    ../ext/Compress/Zlib/t/16oneshot.t......FAILED at test 1622
    ../ext/Compress/Zlib/t/05examples.t.....FAILED at test 10

[en_US.utf8] -DPERL_DEBUG_COW
[en_US.utf8] -DDEBUGGING -DPERL_DEBUG_COW
[en_US.utf8] -DDEBUGGING -DPERL_DEBUG_COW -Duseithreads -DPERL_USE_SAFE_PUTENV
[en_US.utf8] -DPERL_DEBUG_COW -Duseithreads
[en_US.utf8] -DDEBUGGING -DPERL_DEBUG_COW -Duseithreads
[en_US.utf8] -DDEBUGGING -DPERL_USE_SAFE_PUTENV
[en_US.utf8] 
[en_US.utf8] -Duseithreads -DPERL_USE_SAFE_PUTENV
[en_US.utf8] -DDEBUGGING -Duseithreads -DPERL_USE_SAFE_PUTENV
[en_US.utf8] -Duseithreads
[en_US.utf8] -DDEBUGGING -Duseithreads
    ../ext/Compress/Zlib/t/04def.t..........FAILED 111-1775
    ../ext/Compress/Zlib/t/14gzopen.t.......FAILED 129 133 140
                                                   144 151 155
Inconsistent test results (between TEST and harness):
    ../ext/Compress/Zlib/t/16oneshot.t......FAILED--expected 2526 tests, saw 1621
    ../ext/Compress/Zlib/t/05examples.t.....FAILED at test 10

[en_US.utf8] -DPERL_DEBUG_COW -Duseithreads -DPERL_USE_SAFE_PUTENV
[en_US.utf8] -DPERL_USE_SAFE_PUTENV
    ../ext/Compress/Zlib/t/04def.t..........FAILED 111-1775
    ../ext/Compress/Zlib/t/14gzopen.t.......FAILED 129 133 140
                                                   144 151 155
Inconsistent test results (between TEST and harness):
    ../ext/Compress/Zlib/t/16oneshot.t......FAILED at test 1622
    ../ext/Compress/Zlib/t/05examples.t.....FAILED at test 10

[en_US.utf8] -DDEBUGGING
    ../ext/Compress/Zlib/t/04def.t..........FAILED 111-1775
    ../ext/Compress/Zlib/t/14gzopen.t.......FAILED 129 133 140
                                                   144 151 155
                                                   1696 1698-1700
                                                   1702-1703 1708
                                                   1710-1712
                                                   1714-1715 1780
                                                   1835-2526
Inconsistent test results (between TEST and harness):
    ../ext/Compress/Zlib/t/16oneshot.t......FAILED--expected 2526 tests, saw 1621
    ../ext/Compress/Zlib/t/05examples.t.....FAILED at test 10

-- 
Report by Test::Smoke v1.19#716 running on perl 5.8.7
(Reporter v0.016 / Smoker v0.015)




nntp.perl.org: Perl Programming lists via nntp and http.
Comments to Ask Bjørn Hansen at ask@perl.org | Group listing | About