develooper Front page | perl.perl5.porters | Postings from October 2005

Smoke [5.9.3] 25711 FAIL(XF) freebsd 5.4-STABLE (i386/6 cpu)

From:
david
Date:
October 7, 2005 12:28
Subject:
Smoke [5.9.3] 25711 FAIL(XF) freebsd 5.4-STABLE (i386/6 cpu)
Message ID:
20051007194253.3F5942E019@profane.mongueurs.net
Automated smoke report for 5.9.3 patch 25711
profane.mongueurs.net: Intel Pentium III Xeon (i386/6 cpu)
    on        freebsd - 5.4-STABLE
    using     cc version 3.4.2 [FreeBSD] 20040728
    smoketime 10 hours 22 minutes (average 38 minutes 54 seconds)

Summary: FAIL(XF)

O = OK  F = Failure(s), extended report at the bottom
X = Failure(s) under TEST but not under harness
? = still running or test results not (yet) available
Build failures during:       - = unknown or N/A
c = Configure, m = make, M = make (after miniperl), t = make test-prep

   25711     Configuration (common) none
----------- ---------------------------------------------------------
O O O O     
O O O O     -DPERL_COPY_ON_WRITE
X X O O     -Dusemymalloc
X X O O     -Dusemymalloc -DPERL_COPY_ON_WRITE
O O O O     -Duseithreads
O O O O     -Duseithreads -DPERL_COPY_ON_WRITE
X X O O     -Duseithreads -Dusemymalloc
X X F X     -Duseithreads -Dusemymalloc -DPERL_COPY_ON_WRITE
| | | +----- PERLIO = perlio -DDEBUGGING
| | +------- PERLIO = stdio  -DDEBUGGING
| +--------- PERLIO = perlio
+----------- PERLIO = stdio

Locally applied patches:
    DEVEL
    SMOKE25711

Failures: (common-args) none
[stdio/perlio] -Dusemymalloc
[stdio/perlio] -Dusemymalloc -DPERL_COPY_ON_WRITE
[perlio] -Duseithreads -Dusemymalloc
Inconsistent test results (between TEST and harness):
    ../ext/Compress/Zlib/t/08encoding.t.....FAILED--expected 16 tests, saw 6

[stdio] -Duseithreads -Dusemymalloc
Inconsistent test results (between TEST and harness):
    ../ext/threads/t/stress_string.t........FAILED--expected 64 tests, saw 22
    ../ext/Compress/Zlib/t/08encoding.t.....FAILED--expected 16 tests, saw 6

[stdio] -Duseithreads -Dusemymalloc -DPERL_COPY_ON_WRITE
Inconsistent test results (between TEST and harness):
    ../ext/threads/t/stress_cv.t............FAILED--expected 64 tests, saw 12
    ../ext/Compress/Zlib/t/08encoding.t.....FAILED--expected 16 tests, saw 6

[perlio] -Duseithreads -Dusemymalloc -DPERL_COPY_ON_WRITE
Inconsistent test results (between TEST and harness):
    ../ext/threads/t/stress_string.t........FAILED--expected 64 tests, saw 12
    ../ext/Compress/Zlib/t/08encoding.t.....FAILED--expected 16 tests, saw 6

[stdio] -DDEBUGGING -Duseithreads -Dusemymalloc -DPERL_COPY_ON_WRITE
    ../ext/threads/t/stress_cv.t............FAILED 30-64

[perlio] -DDEBUGGING -Duseithreads -Dusemymalloc -DPERL_COPY_ON_WRITE
Inconsistent test results (between TEST and harness):
    ../ext/threads/t/stress_string.t........FAILED--expected 64 tests, saw 5

Compiler messages(gcc):
mg.c: In function `Perl_sighandler':
mg.c:2760: warning: null format string
sv.c: In function `Perl_sv_clear':
sv.c:5568: warning: ignoring return value of `Perl_io_close', declared with attribute warn_unused_result
pp_sys.c: In function `Perl_pp_die':
pp_sys.c:514: warning: null format string
proto.h:3300: warning: 'S_emulate_eaccess' declared `static' but never defined
byterun.c: In function `byterun':
byterun.c:893: warning: comparison is always false due to limited range of data type
pp_ctl.c: In function `Perl_pp_require':
pp_ctl.c:3346: warning: null argument where non-null required (arg 3)
perlio.c: In function `PerlIO_clone':
perlio.c:648: warning: ignoring return value of `Perl_fp_dup', declared with attribute warn_unused_result

-- 
Report by Test::Smoke v1.19_75 build 911 running on perl 5.8.7
(Reporter v0.026 / Smoker v0.026)



nntp.perl.org: Perl Programming lists via nntp and http.
Comments to Ask Bjørn Hansen at ask@perl.org | Group listing | About