develooper Front page | perl.perl5.porters | Postings from October 2005

Smoke [5.8.7] 25673 FAIL(XF) linux 2.6.12-9-686 [debian] (i686/1 cpu)

From:
steve
Date:
October 1, 2005 10:08
Subject:
Smoke [5.8.7] 25673 FAIL(XF) linux 2.6.12-9-686 [debian] (i686/1 cpu)
Message ID:
20051001170844.620D4964AE@localhost.localdomain
Automated smoke report for 5.8.7 patch 25673
kirk: Intel(R) Celeron(R) CPU 2.00GHz (GenuineIntel 1994MHz) (i686/1 cpu)
    on        linux - 2.6.12-9-686 [debian]
    using     cc version 4.0.2 20050808 (prerelease) (Ubuntu 4.0.1-4ubuntu8)
    smoketime 10 hours 53 minutes (average 36 minutes 18 seconds)

Summary: FAIL(XF)

O = OK  F = Failure(s), extended report at the bottom
X = Failure(s) under TEST but not under harness
? = still running or test results not (yet) available
Build failures during:       - = unknown or N/A
c = Configure, m = make, M = make (after miniperl), t = make test-prep

   25673     Configuration (common) none
----------- ---------------------------------------------------------
F - - F - - -Uuseperlio
O O O O O O 
O O O O O O -Duse64bitint
O O O O O O -Duselongdouble
O O O X X X -Dusemorebits
O O O O O O -Duseithreads
O O O O O O -Duseithreads -Duse64bitint
O O O O O O -Duseithreads -Duselongdouble
X X X X X X -Duseithreads -Dusemorebits
| | | | | +- LC_ALL = en_US.utf8 -DDEBUGGING
| | | | +--- PERLIO = perlio -DDEBUGGING
| | | +----- PERLIO = stdio  -DDEBUGGING
| | +------- LC_ALL = en_US.utf8
| +--------- PERLIO = perlio
+----------- PERLIO = stdio


Failures:
[stdio] -Uuseperlio
[stdio] -DDEBUGGING -Uuseperlio
    ../ext/IO/t/io_sock.t...................FAILED 18-26

[stdio/perlio/en_US.utf8] -DDEBUGGING -Dusemorebits
Inconsistent test results (between TEST and harness):
    ../lib/ExtUtils/t/Constant.t............FAILED at test 3

[stdio/perlio/en_US.utf8] -Duseithreads -Dusemorebits
Inconsistent test results (between TEST and harness):
    ../ext/threads/shared/t/av_simple.t.....FAILED--expected 43 tests, saw 9

[stdio/perlio/en_US.utf8] -DDEBUGGING -Duseithreads -Dusemorebits
Inconsistent test results (between TEST and harness):
    ../ext/threads/shared/t/av_simple.t.....FAILED--expected 43 tests, saw 9
    ../lib/ExtUtils/t/Constant.t............FAILED at test 3

-- 
Report by Test::Smoke v1.19#716 running on perl 5.8.7
(Reporter v0.016 / Smoker v0.015)




nntp.perl.org: Perl Programming lists via nntp and http.
Comments to Ask Bjørn Hansen at ask@perl.org | Group listing | About