develooper Front page | perl.perl5.porters | Postings from December 2004

Smoke [5.9.2] 23700 FAIL(F) openbsd 3.6 (i386/1 cpu)

From:
perlsmoke
Date:
December 29, 2004 11:32
Subject:
Smoke [5.9.2] 23700 FAIL(F) openbsd 3.6 (i386/1 cpu)
Message ID:
perl.perl5.porters-97210@nntp.perl.org
Automated smoke report for 5.9.2 patch 23700
sigcafe.xs4all.nl: AMD Athlon(tm) XP 1800+ ("AuthenticAMD" 686-class) (i386/1 cpu)
    on        openbsd - 3.6
    using     cc version 2.95.3 20010125 (prerelease, propolice)
    smoketime 2 hours 50 minutes (average 21 minutes 18 seconds)

Summary: FAIL(F)

O = OK  F = Failure(s), extended report at the bottom
X = Failure(s) under TEST but not under harness
? = still running or test results not (yet) available
Build failures during:       - = unknown or N/A
c = Configure, m = make, M = make (after miniperl), t = make test-prep

   23700     Configuration (common) none
----------- ---------------------------------------------------------
F F F F     
F F F F     -Duse64bitint
F F F F     -Duseithreads
F F F F     -Duseithreads -Duse64bitint
| | | +----- PERLIO = perlio -DDEBUGGING
| | +------- PERLIO = stdio  -DDEBUGGING
| +--------- PERLIO = perlio
+----------- PERLIO = stdio


Failures:
[stdio/perlio] 
[stdio/perlio] -DDEBUGGING
[perlio] -Duse64bitint
[stdio/perlio] -DDEBUGGING -Duse64bitint
    ../lib/Net/Ping/t/450_service.t.........FAILED 9 18

[stdio] -Duse64bitint
    ../lib/Net/Ping/t/450_service.t.........FAILED 9 18
Inconsistent test results (between TEST and harness):
    ../t/op/alarm.t.........................FAILED at test 2

[stdio] -Duseithreads
    ../ext/IO/t/io_multihomed.t.............FAILED 1-8
    ../ext/IO/t/io_sock.t...................FAILED 1-26
    ../ext/IO/t/io_udp.t....................FAILED 1-7
    ../lib/Net/Ping/t/120_udp_inst.t........FAILED ??
    ../lib/Net/Ping/t/130_tcp_inst.t........FAILED ??
    ../lib/Net/Ping/t/150_syn_inst.t........FAILED ??
    ../lib/Net/Ping/t/190_alarm.t...........FAILED ??
    ../lib/Net/Ping/t/450_service.t.........FAILED ??
    ../lib/Net/Ping/t/510_ping_udp.t........FAILED ??
    ../lib/Net/protoent.t...................FAILED ??
    ../lib/Net/servent.t....................FAILED ??
    ../lib/Net/t/time.t.....................FAILED ??
Inconsistent test results (between TEST and harness):
    ../ext/Time/HiRes/t/HiRes.t.............FAILED at test 6
    ../lib/Net/Ping/t/140_stream_inst.t.....FAILED at test 0

[perlio] -Duseithreads
[stdio/perlio] -DDEBUGGING -Duseithreads
[stdio/perlio] -Duseithreads -Duse64bitint
[stdio/perlio] -DDEBUGGING -Duseithreads -Duse64bitint
    ../ext/IO/t/io_multihomed.t.............FAILED 1-8
    ../ext/IO/t/io_sock.t...................FAILED 1-26
    ../ext/IO/t/io_udp.t....................FAILED 1-7
    ../lib/Net/Ping/t/120_udp_inst.t........FAILED ??
    ../lib/Net/Ping/t/130_tcp_inst.t........FAILED ??
    ../lib/Net/Ping/t/150_syn_inst.t........FAILED ??
    ../lib/Net/Ping/t/190_alarm.t...........FAILED ??
    ../lib/Net/Ping/t/450_service.t.........FAILED ??
    ../lib/Net/Ping/t/510_ping_udp.t........FAILED ??
    ../lib/Net/protoent.t...................FAILED ??
    ../lib/Net/servent.t....................FAILED ??
    ../lib/Net/t/time.t.....................FAILED ??
Inconsistent test results (between TEST and harness):
    ../lib/Net/Ping/t/140_stream_inst.t.....FAILED at test 0

-- 
Report by Test::Smoke v1.19#716 running on perl 5.8.5
(Reporter v0.016 / Smoker v0.015)




nntp.perl.org: Perl Programming lists via nntp and http.
Comments to Ask Bjørn Hansen at ask@perl.org | Group listing | About