develooper Front page | perl.perl5.porters | Postings from December 2004

Smoke [5.9.2] 23624 FAIL(Fm) openbsd 3.6 (i386/1 cpu)

From:
perlsmoke
Date:
December 7, 2004 14:02
Subject:
Smoke [5.9.2] 23624 FAIL(Fm) openbsd 3.6 (i386/1 cpu)
Message ID:
perl.perl5.porters-96588@nntp.perl.org
Automated smoke report for 5.9.2 patch 23624
sigcafe.xs4all.nl: AMD Athlon(tm) XP 1800+ ("AuthenticAMD" 686-class) (i386/1 cpu)
    on        openbsd - 3.6
    using     cc version 2.95.3 20010125 (prerelease, propolice)
    smoketime 1 hour 54 minutes (average 14 minutes 20 seconds)

Summary: FAIL(Fm)

O = OK  F = Failure(s), extended report at the bottom
X = Failure(s) under TEST but not under harness
? = still running or test results not (yet) available
Build failures during:       - = unknown or N/A
c = Configure, m = make, M = make (after miniperl), t = make test-prep

   23624     Configuration (common) none
----------- ---------------------------------------------------------
F F F F     
F F F F     -Duse64bitint
m - m -     -Duseithreads
m - m -     -Duseithreads -Duse64bitint
| | | +----- PERLIO = perlio -DDEBUGGING
| | +------- PERLIO = stdio  -DDEBUGGING
| +--------- PERLIO = perlio
+----------- PERLIO = stdio


Failures:
[stdio/perlio] 
[stdio] -DDEBUGGING
[stdio/perlio] -Duse64bitint
[stdio/perlio] -DDEBUGGING -Duse64bitint
    ../lib/Net/Ping/t/450_service.t.........FAILED 9 18

[perlio] -DDEBUGGING
    ../lib/Net/Ping/t/450_service.t.........FAILED 9 18
Inconsistent test results (between TEST and harness):
    ../ext/Time/HiRes/t/HiRes.t.............FAILED at test 17

-- 
Report by Test::Smoke v1.19#716 running on perl 5.8.5
(Reporter v0.016 / Smoker v0.015)




nntp.perl.org: Perl Programming lists via nntp and http.
Comments to Ask Bjørn Hansen at ask@perl.org | Group listing | About