develooper Front page | perl.perl5.porters | Postings from November 2004

Smoke [5.9.2] 23548 FAIL(XF) openbsd 3.6 (i386/1 cpu)

From:
steve
Date:
November 27, 2004 05:23
Subject:
Smoke [5.9.2] 23548 FAIL(XF) openbsd 3.6 (i386/1 cpu)
Message ID:
200411271323.iARDNRDw006845@mccoy.peters.homeunix.org
Automated smoke report for 5.9.2 patch 23548
mccoy.peters.homeunix.org: Intel Pentium III ("GenuineIntel" 686-class, 512KB L2 cache) (i386/1 cpu)
    on        openbsd - 3.6
    using     cc version 2.95.3 20010125 (prerelease, propolice)
    smoketime 7 hours 18 minutes (average 54 minutes 45 seconds)

Summary: FAIL(XF)

O = OK  F = Failure(s), extended report at the bottom
X = Failure(s) under TEST but not under harness
? = still running or test results not (yet) available
Build failures during:       - = unknown or N/A
c = Configure, m = make, M = make (after miniperl), t = make test-prep

   23548     Configuration (common) none
----------- ---------------------------------------------------------
O O O O     
O O O O     -Duse64bitint
X X F X     -Duseithreads
X X X X     -Duseithreads -Duse64bitint
| | | +----- PERLIO = perlio -DDEBUGGING
| | +------- PERLIO = stdio  -DDEBUGGING
| +--------- PERLIO = perlio
+----------- PERLIO = stdio


Failures:
[stdio/perlio] -Duseithreads
[perlio] -DDEBUGGING -Duseithreads
[stdio/perlio] -Duseithreads -Duse64bitint
[stdio/perlio] -DDEBUGGING -Duseithreads -Duse64bitint
Inconsistent test results (between TEST and harness):
    ../lib/Net/t/time.t.....................FAILED at test 0

[stdio] -DDEBUGGING -Duseithreads
    ../lib/Net/t/time.t.....................FAILED ??
Inconsistent test results (between TEST and harness):
    ../lib/ExtUtils/t/Constant.t............FAILED at test 103

-- 
Report by Test::Smoke v1.19#716 running on perl 5.8.5
(Reporter v0.016 / Smoker v0.015)




nntp.perl.org: Perl Programming lists via nntp and http.
Comments to Ask Bjørn Hansen at ask@perl.org | Group listing | About