develooper Front page | perl.perl5.porters | Postings from November 2004

Smoke [] 23528 FAIL(XF) ()

From:
David Landgren
Date:
November 23, 2004 19:06
Subject:
Smoke [] 23528 FAIL(XF) ()
Message ID:
20041124030616.62B972A544@relay.bpinet.com
Automated smoke report for  patch 23528 on  -  ()
(bechet.bpinet.com) using  version 
Report by Test::Smoke v1.18.10 (perl 5.8.3) [12 hours 27 minutes]

O = OK  F = Failure(s), extended report at the bottom
X = test(s) failed under TEST but not under harness
? = still running or test results not (yet) available
Build failures during:       - = unknown or N/A
c = Configure, m = make, M = make (after miniperl), t = make test-prep

   23528     Configuration (common) none
------------ ----------------------------------------------------------------
O O O O
O O O X      -Dusemultiplicity
O O O O      -Dusemymalloc
O O O X      -Dusemymalloc -Dusemultiplicity
O O O O      -Duse64bitint
X O O O      -Duse64bitint -Dusemultiplicity
O O O O      -Duse64bitint -Dusemymalloc
O O O O      -Duse64bitint -Dusemymalloc -Dusemultiplicity
O - O -      -Uuseperlio
O - O -      -Uuseperlio -Dusemultiplicity
X - O -      -Uuseperlio -Dusemymalloc
O - O -      -Uuseperlio -Dusemymalloc -Dusemultiplicity
O - O -      -Uuseperlio -Duse64bitint
O - O -      -Uuseperlio -Duse64bitint -Dusemultiplicity
O - O -      -Uuseperlio -Duse64bitint -Dusemymalloc
O - O -      -Uuseperlio -Duse64bitint -Dusemymalloc -Dusemultiplicity
O O O O      -Duseithreads
O O O O      -Duseithreads -Dusemultiplicity
O O O O      -Duseithreads -Dusemymalloc
O O O O      -Duseithreads -Dusemymalloc -Dusemultiplicity
O O O O      -Duseithreads -Duse64bitint
O O O O      -Duseithreads -Duse64bitint -Dusemultiplicity
O O O O      -Duseithreads -Duse64bitint -Dusemymalloc
X O O F      -Duseithreads -Duse64bitint -Dusemymalloc -Dusemultiplicity
| | | +----- PERLIO = perlio -DDEBUGGING
| | +------- PERLIO = stdio  -DDEBUGGING
| +--------- PERLIO = perlio
+----------- PERLIO = stdio

Summary: FAIL(XF)


Failures:

freebsd     [perlio      ]-DDEBUGGING -Dusemultiplicity
freebsd     [perlio      ]-DDEBUGGING -Dusemymalloc -Dusemultiplicity
Inconsistent test results (between TEST and harness):
    ../lib/Benchmark.t......................FAILED at test 13

freebsd     [stdio       ]-Duse64bitint -Dusemultiplicity
freebsd     [stdio       ]-Uuseperlio -Dusemymalloc
Inconsistent test results (between TEST and harness):
    ../lib/Benchmark.t......................FAILED at test 13

freebsd     [stdio       ]-Duseithreads -Duse64bitint -Dusemymalloc
              (cont) -Dusemultiplicity
Inconsistent test results (between TEST and harness):
    ../ext/threads/t/stress_cv.t............FAILED at test 23

freebsd     [perlio      ]-DDEBUGGING -Duseithreads -Duse64bitint
              (cont) -Dusemymalloc -Dusemultiplicity
    ../ext/threads/t/stress_cv.t............FAILED 6-64



MANIFEST did not declare 'Cross/MD5SUM'
MANIFEST did not declare 'MD5SUM'
MANIFEST did not declare 'NetWare/MD5SUM'
MANIFEST did not declare 'NetWare/bat/MD5SUM'
MANIFEST did not declare 'NetWare/t/MD5SUM'
MANIFEST did not declare 'NetWare/testnlm/echo/MD5SUM'
MANIFEST did not declare 'NetWare/testnlm/type/MD5SUM'
MANIFEST did not declare 'Porting/MD5SUM'
MANIFEST did not declare 'apollo/netinet/MD5SUM'
MANIFEST did not declare 'beos/MD5SUM'
MANIFEST did not declare 'cygwin/MD5SUM'
MANIFEST did not declare 'djgpp/MD5SUM'
MANIFEST did not declare 'emacs/MD5SUM'
MANIFEST did not declare 'epoc/MD5SUM'
MANIFEST did not declare 'ext/B/B/MD5SUM'
MANIFEST did not declare 'ext/B/C/MD5SUM'
MANIFEST did not declare 'ext/B/MD5SUM'
MANIFEST did not declare 'ext/B/hints/MD5SUM'
MANIFEST did not declare 'ext/B/ramblings/MD5SUM'
MANIFEST did not declare 'ext/B/t/MD5SUM'
MANIFEST did not declare 'ext/ByteLoader/MD5SUM'
MANIFEST did not declare 'ext/ByteLoader/hints/MD5SUM'
MANIFEST did not declare 'ext/Cwd/MD5SUM'
MANIFEST did not declare 'ext/Cwd/t/MD5SUM'
MANIFEST did not declare 'ext/DB_File/MD5SUM'
MANIFEST did not declare 'ext/DB_File/hints/MD5SUM'
MANIFEST did not declare 'ext/DB_File/t/MD5SUM'
MANIFEST did not declare 'ext/Data/Dumper/MD5SUM'
MANIFEST did not declare 'ext/Data/Dumper/t/MD5SUM'
MANIFEST did not declare 'ext/Devel/DProf/MD5SUM'
MANIFEST did not declare 'ext/Devel/DProf/t/MD5SUM'
MANIFEST did not declare 'ext/Devel/PPPort/MD5SUM'
MANIFEST did not declare 'ext/Devel/PPPort/devel/MD5SUM'
MANIFEST did not declare 'ext/Devel/PPPort/parts/MD5SUM'
MANIFEST did not declare 'ext/Devel/PPPort/parts/base/MD5SUM'
MANIFEST did not declare 'ext/Devel/PPPort/parts/inc/MD5SUM'
MANIFEST did not declare 'ext/Devel/PPPort/parts/todo/MD5SUM'
MANIFEST did not declare 'ext/Devel/PPPort/t/MD5SUM'
MANIFEST did not declare 'ext/Devel/Peek/MD5SUM'
MANIFEST did not declare 'ext/Devel/Peek/t/MD5SUM'
MANIFEST did not declare 'ext/Digest/MD5/MD5SUM'
MANIFEST did not declare 'ext/Digest/MD5/hints/MD5SUM'
MANIFEST did not declare 'ext/Digest/MD5/t/MD5SUM'
MANIFEST did not declare 'ext/DynaLoader/MD5SUM'
MANIFEST did not declare 'ext/DynaLoader/hints/MD5SUM'
MANIFEST did not declare 'ext/DynaLoader/t/MD5SUM'
MANIFEST did not declare 'ext/Encode/Byte/MD5SUM'
MANIFEST did not declare 'ext/Encode/CN/MD5SUM'
MANIFEST did not declare 'ext/Encode/EBCDIC/MD5SUM'
MANIFEST did not declare 'ext/Encode/Encode/MD5SUM'
MANIFEST did not declare 'ext/Encode/JP/MD5SUM'
MANIFEST did not declare 'ext/Encode/KR/MD5SUM'
MANIFEST did not declare 'ext/Encode/MD5SUM'
MANIFEST did not declare 'ext/Encode/Symbol/MD5SUM'
MANIFEST did not declare 'ext/Encode/TW/MD5SUM'
MANIFEST did not declare 'ext/Encode/Unicode/MD5SUM'
MANIFEST did not declare 'ext/Encode/bin/MD5SUM'
MANIFEST did not declare 'ext/Encode/lib/Encode/CN/MD5SUM'
MANIFEST did not declare 'ext/Encode/lib/Encode/JP/MD5SUM'
MANIFEST did not declare 'ext/Encode/lib/Encode/KR/MD5SUM'
MANIFEST did not declare 'ext/Encode/lib/Encode/MD5SUM'
MANIFEST did not declare 'ext/Encode/lib/Encode/MIME/MD5SUM'
MANIFEST did not declare 'ext/Encode/lib/Encode/Unicode/MD5SUM'
MANIFEST did not declare 'ext/Encode/t/MD5SUM'
MANIFEST did not declare 'ext/Encode/ucm/MD5SUM'
MANIFEST did not declare 'ext/Errno/MD5SUM'
MANIFEST did not declare 'ext/Errno/t/MD5SUM'
MANIFEST did not declare 'ext/Fcntl/MD5SUM'
MANIFEST did not declare 'ext/Fcntl/t/MD5SUM'
MANIFEST did not declare 'ext/File/Glob/MD5SUM'
MANIFEST did not declare 'ext/File/Glob/t/MD5SUM'
MANIFEST did not declare 'ext/Filter/Util/Call/MD5SUM'
MANIFEST did not declare 'ext/Filter/t/MD5SUM'
MANIFEST did not declare 'ext/GDBM_File/MD5SUM'
MANIFEST did not declare 'ext/GDBM_File/hints/MD5SUM'
MANIFEST did not declare 'ext/GDBM_File/t/MD5SUM'
MANIFEST did not declare 'ext/I18N/Langinfo/MD5SUM'
MANIFEST did not declare 'ext/I18N/Langinfo/fallback/MD5SUM'
MANIFEST did not declare 'ext/I18N/Langinfo/t/MD5SUM'
MANIFEST did not declare 'ext/IO/MD5SUM'
MANIFEST did not declare 'ext/IO/hints/MD5SUM'
MANIFEST did not declare 'ext/IO/lib/IO/MD5SUM'
MANIFEST did not declare 'ext/IO/lib/IO/Socket/MD5SUM'
MANIFEST did not declare 'ext/IO/t/MD5SUM'
MANIFEST did not declare 'ext/IPC/SysV/MD5SUM'
MANIFEST did not declare 'ext/IPC/SysV/hints/MD5SUM'
MANIFEST did not declare 'ext/IPC/SysV/t/MD5SUM'
MANIFEST did not declare 'ext/List/Util/MD5SUM'
MANIFEST did not declare 'ext/List/Util/lib/List/MD5SUM'
MANIFEST did not declare 'ext/List/Util/lib/Scalar/MD5SUM'
MANIFEST did not declare 'ext/List/Util/t/MD5SUM'
MANIFEST did not declare 'ext/MIME/Base64/MD5SUM'
MANIFEST did not declare 'ext/MIME/Base64/t/MD5SUM'
MANIFEST did not declare 'ext/NDBM_File/MD5SUM'
MANIFEST did not declare 'ext/NDBM_File/hints/MD5SUM'
MANIFEST did not declare 'ext/NDBM_File/t/MD5SUM'
MANIFEST did not declare 'ext/ODBM_File/MD5SUM'
MANIFEST did not declare 'ext/ODBM_File/hints/MD5SUM'
MANIFEST did not declare 'ext/ODBM_File/t/MD5SUM'
MANIFEST did not declare 'ext/Opcode/MD5SUM'
MANIFEST did not declare 'ext/Opcode/t/MD5SUM'
MANIFEST did not declare 'ext/POSIX/MD5SUM'
MANIFEST did not declare 'ext/POSIX/hints/MD5SUM'
MANIFEST did not declare 'ext/POSIX/t/MD5SUM'
MANIFEST did not declare 'ext/PerlIO/encoding/MD5SUM'
MANIFEST did not declare 'ext/PerlIO/scalar/MD5SUM'
MANIFEST did not declare 'ext/PerlIO/t/MD5SUM'
MANIFEST did not declare 'ext/PerlIO/via/MD5SUM'
MANIFEST did not declare 'ext/PerlIO/via/hints/MD5SUM'
MANIFEST did not declare 'ext/SDBM_File/MD5SUM'
MANIFEST did not declare 'ext/SDBM_File/sdbm/MD5SUM'
MANIFEST did not declare 'ext/SDBM_File/t/MD5SUM'
MANIFEST did not declare 'ext/Safe/t/MD5SUM'
MANIFEST did not declare 'ext/Socket/MD5SUM'
MANIFEST did not declare 'ext/Socket/t/MD5SUM'
MANIFEST did not declare 'ext/Storable/MD5SUM'
MANIFEST did not declare 'ext/Storable/hints/MD5SUM'
MANIFEST did not declare 'ext/Storable/t/MD5SUM'
MANIFEST did not declare 'ext/Sys/Hostname/MD5SUM'
MANIFEST did not declare 'ext/Sys/Hostname/t/MD5SUM'
MANIFEST did not declare 'ext/Sys/Syslog/MD5SUM'
MANIFEST did not declare 'ext/Sys/Syslog/t/MD5SUM'
MANIFEST did not declare 'ext/Thread/MD5SUM'
MANIFEST did not declare 'ext/Thread/Thread/MD5SUM'
MANIFEST did not declare 'ext/Time/HiRes/MD5SUM'
MANIFEST did not declare 'ext/Time/HiRes/fallback/MD5SUM'
MANIFEST did not declare 'ext/Time/HiRes/hints/MD5SUM'
MANIFEST did not declare 'ext/Time/HiRes/t/MD5SUM'
MANIFEST did not declare 'ext/Unicode/Normalize/MD5SUM'
MANIFEST did not declare 'ext/Unicode/Normalize/t/MD5SUM'
MANIFEST did not declare 'ext/XS/APItest/MD5SUM'
MANIFEST did not declare 'ext/XS/APItest/t/MD5SUM'
MANIFEST did not declare 'ext/XS/Typemap/MD5SUM'
MANIFEST did not declare 'ext/XS/Typemap/t/MD5SUM'
MANIFEST did not declare 'ext/attrs/MD5SUM'
MANIFEST did not declare 'ext/attrs/t/MD5SUM'
MANIFEST did not declare 'ext/re/MD5SUM'
MANIFEST did not declare 'ext/re/hints/MD5SUM'
MANIFEST did not declare 'ext/re/t/MD5SUM'
MANIFEST did not declare 'ext/threads/MD5SUM'
MANIFEST did not declare 'ext/threads/shared/MD5SUM'
MANIFEST did not declare 'ext/threads/shared/t/MD5SUM'
MANIFEST did not declare 'ext/threads/t/MD5SUM'
MANIFEST did not declare 'ext/util/MD5SUM'
MANIFEST did not declare 'h2pl/MD5SUM'
MANIFEST did not declare 'h2pl/eg/MD5SUM'
MANIFEST did not declare 'h2pl/eg/sys/MD5SUM'
MANIFEST did not declare 'hints/MD5SUM'
MANIFEST did not declare 'jpl/JNI/MD5SUM'
MANIFEST did not declare 'jpl/JPL/MD5SUM'
MANIFEST did not declare 'jpl/JPL_Rolo/MD5SUM'
MANIFEST did not declare 'jpl/MD5SUM'
MANIFEST did not declare 'jpl/PerlInterpreter/MD5SUM'
MANIFEST did not declare 'jpl/Sample/MD5SUM'
MANIFEST did not declare 'jpl/Test/MD5SUM'
MANIFEST did not declare 'jpl/bin/MD5SUM'
MANIFEST did not declare 'jpl/docs/MD5SUM'
MANIFEST did not declare 'jpl/get_jdk/MD5SUM'
MANIFEST did not declare 'lib/Attribute/Handlers/MD5SUM'
MANIFEST did not declare 'lib/Attribute/Handlers/demo/MD5SUM'
MANIFEST did not declare 'lib/Attribute/Handlers/t/MD5SUM'
MANIFEST did not declare 'lib/Attribute/MD5SUM'
MANIFEST did not declare 'lib/CGI/MD5SUM'
MANIFEST did not declare 'lib/CGI/eg/MD5SUM'
MANIFEST did not declare 'lib/CGI/t/MD5SUM'
MANIFEST did not declare 'lib/CPAN/MD5SUM'
MANIFEST did not declare 'lib/CPAN/bin/MD5SUM'
MANIFEST did not declare 'lib/CPAN/t/MD5SUM'
MANIFEST did not declare 'lib/Carp/MD5SUM'
MANIFEST did not declare 'lib/Class/ISA/MD5SUM'
MANIFEST did not declare 'lib/Class/MD5SUM'
MANIFEST did not declare 'lib/DBM_Filter/MD5SUM'
MANIFEST did not declare 'lib/DBM_Filter/t/MD5SUM'
MANIFEST did not declare 'lib/Devel/MD5SUM'
MANIFEST did not declare 'lib/Digest/MD5SUM'
MANIFEST did not declare 'lib/Digest/t/MD5SUM'
MANIFEST did not declare 'lib/Env/t/MD5SUM'
MANIFEST did not declare 'lib/Exporter/MD5SUM'
MANIFEST did not declare 'lib/ExtUtils/Command/MD5SUM'
MANIFEST did not declare 'lib/ExtUtils/Liblist/MD5SUM'
MANIFEST did not declare 'lib/ExtUtils/MD5SUM'
MANIFEST did not declare 'lib/ExtUtils/MakeMaker/MD5SUM'
MANIFEST did not declare 'lib/ExtUtils/t/MD5SUM'
MANIFEST did not declare 'lib/File/Find/t/MD5SUM'
MANIFEST did not declare 'lib/File/MD5SUM'
MANIFEST did not declare 'lib/File/Spec/MD5SUM'
MANIFEST did not declare 'lib/File/Spec/t/MD5SUM'
MANIFEST did not declare 'lib/File/Temp/t/MD5SUM'
MANIFEST did not declare 'lib/FileCache/t/MD5SUM'
MANIFEST did not declare 'lib/Filter/MD5SUM'
MANIFEST did not declare 'lib/Filter/Simple/MD5SUM'
MANIFEST did not declare 'lib/Filter/Simple/t/MD5SUM'
MANIFEST did not declare 'lib/Getopt/Long/MD5SUM'
MANIFEST did not declare 'lib/Getopt/Long/t/MD5SUM'
MANIFEST did not declare 'lib/Getopt/MD5SUM'
MANIFEST did not declare 'lib/Hash/MD5SUM'
MANIFEST did not declare 'lib/I18N/LangTags/MD5SUM'
MANIFEST did not declare 'lib/I18N/LangTags/t/MD5SUM'
MANIFEST did not declare 'lib/I18N/MD5SUM'
MANIFEST did not declare 'lib/IPC/MD5SUM'
MANIFEST did not declare 'lib/Locale/Codes/MD5SUM'
MANIFEST did not declare 'lib/Locale/Codes/t/MD5SUM'
MANIFEST did not declare 'lib/Locale/MD5SUM'
MANIFEST did not declare 'lib/Locale/Maketext/MD5SUM'
MANIFEST did not declare 'lib/Locale/Maketext/t/MD5SUM'
MANIFEST did not declare 'lib/MD5SUM'
MANIFEST did not declare 'lib/Math/BigFloat/MD5SUM'
MANIFEST did not declare 'lib/Math/BigInt/MD5SUM'
MANIFEST did not declare 'lib/Math/BigInt/t/MD5SUM'
MANIFEST did not declare 'lib/Math/BigRat/t/MD5SUM'
MANIFEST did not declare 'lib/Math/MD5SUM'
MANIFEST did not declare 'lib/Memoize/MD5SUM'
MANIFEST did not declare 'lib/Memoize/t/MD5SUM'
MANIFEST did not declare 'lib/NEXT/MD5SUM'
MANIFEST did not declare 'lib/NEXT/t/MD5SUM'
MANIFEST did not declare 'lib/Net/FTP/MD5SUM'
MANIFEST did not declare 'lib/Net/MD5SUM'
MANIFEST did not declare 'lib/Net/Ping/MD5SUM'
MANIFEST did not declare 'lib/Net/Ping/t/MD5SUM'
MANIFEST did not declare 'lib/Net/demos/MD5SUM'
MANIFEST did not declare 'lib/Net/t/MD5SUM'
MANIFEST did not declare 'lib/PerlIO/via/MD5SUM'
MANIFEST did not declare 'lib/PerlIO/via/t/MD5SUM'
MANIFEST did not declare 'lib/Pod/MD5SUM'
MANIFEST did not declare 'lib/Pod/Perldoc/MD5SUM'
MANIFEST did not declare 'lib/Pod/Perldoc/t/MD5SUM'
MANIFEST did not declare 'lib/Pod/Text/MD5SUM'
MANIFEST did not declare 'lib/Pod/t/MD5SUM'
MANIFEST did not declare 'lib/Search/MD5SUM'
MANIFEST did not declare 'lib/Switch/MD5SUM'
MANIFEST did not declare 'lib/Switch/t/MD5SUM'
MANIFEST did not declare 'lib/Term/ANSIColor/MD5SUM'
MANIFEST did not declare 'lib/Term/MD5SUM'
MANIFEST did not declare 'lib/Test/Harness/MD5SUM'
MANIFEST did not declare 'lib/Test/Harness/bin/MD5SUM'
MANIFEST did not declare 'lib/Test/Harness/t/MD5SUM'
MANIFEST did not declare 'lib/Test/MD5SUM'
MANIFEST did not declare 'lib/Test/Simple/MD5SUM'
MANIFEST did not declare 'lib/Test/Simple/t/MD5SUM'
MANIFEST did not declare 'lib/Test/t/MD5SUM'
MANIFEST did not declare 'lib/Text/Balanced/MD5SUM'
MANIFEST did not declare 'lib/Text/Balanced/t/MD5SUM'
MANIFEST did not declare 'lib/Text/MD5SUM'
MANIFEST did not declare 'lib/Text/TabsWrap/MD5SUM'
MANIFEST did not declare 'lib/Text/TabsWrap/t/MD5SUM'
MANIFEST did not declare 'lib/Thread/MD5SUM'
MANIFEST did not declare 'lib/Tie/Array/MD5SUM'
MANIFEST did not declare 'lib/Tie/File/t/MD5SUM'
MANIFEST did not declare 'lib/Tie/Handle/MD5SUM'
MANIFEST did not declare 'lib/Tie/MD5SUM'
MANIFEST did not declare 'lib/Time/MD5SUM'
MANIFEST did not declare 'lib/Unicode/Collate/MD5SUM'
MANIFEST did not declare 'lib/Unicode/Collate/t/MD5SUM'
MANIFEST did not declare 'lib/Unicode/MD5SUM'
MANIFEST did not declare 'lib/User/MD5SUM'
MANIFEST did not declare 'lib/assertions/MD5SUM'
MANIFEST did not declare 'lib/base/t/MD5SUM'
MANIFEST did not declare 'lib/bignum/t/MD5SUM'
MANIFEST did not declare 'lib/unicore/MD5SUM'
MANIFEST did not declare 'lib/warnings/MD5SUM'
MANIFEST did not declare 'mint/MD5SUM'
MANIFEST did not declare 'mint/sys/MD5SUM'
MANIFEST did not declare 'mpeix/MD5SUM'
MANIFEST did not declare 'os2/MD5SUM'
MANIFEST did not declare 'os2/OS2/ExtAttr/MD5SUM'
MANIFEST did not declare 'os2/OS2/ExtAttr/t/MD5SUM'
MANIFEST did not declare 'os2/OS2/MD5SUM'
MANIFEST did not declare 'os2/OS2/PrfDB/MD5SUM'
MANIFEST did not declare 'os2/OS2/PrfDB/t/MD5SUM'
MANIFEST did not declare 'os2/OS2/Process/MD5SUM'
MANIFEST did not declare 'os2/OS2/Process/t/MD5SUM'
MANIFEST did not declare 'os2/OS2/REXX/DLL/MD5SUM'
MANIFEST did not declare 'os2/OS2/REXX/MD5SUM'
MANIFEST did not declare 'os2/OS2/REXX/t/MD5SUM'
MANIFEST did not declare 'plan9/MD5SUM'
MANIFEST did not declare 'plan9/arpa/MD5SUM'
MANIFEST did not declare 'pod/MD5SUM'
MANIFEST did not declare 'qnx/MD5SUM'
MANIFEST did not declare 't/MD5SUM'
MANIFEST did not declare 't/base/MD5SUM'
MANIFEST did not declare 't/cmd/MD5SUM'
MANIFEST did not declare 't/comp/MD5SUM'
MANIFEST did not declare 't/io/MD5SUM'
MANIFEST did not declare 't/japh/MD5SUM'
MANIFEST did not declare 't/lib/Dev/MD5SUM'
MANIFEST did not declare 't/lib/Devel/MD5SUM'
MANIFEST did not declare 't/lib/Filter/Simple/MD5SUM'
MANIFEST did not declare 't/lib/MD5SUM'
MANIFEST did not declare 't/lib/MakeMaker/Test/MD5SUM'
MANIFEST did not declare 't/lib/MakeMaker/Test/Setup/MD5SUM'
MANIFEST did not declare 't/lib/Math/BigFloat/MD5SUM'
MANIFEST did not declare 't/lib/Math/BigInt/MD5SUM'
MANIFEST did not declare 't/lib/Math/BigRat/MD5SUM'
MANIFEST did not declare 't/lib/Test/Simple/MD5SUM'
MANIFEST did not declare 't/lib/Test/Simple/sample_tests/MD5SUM'
MANIFEST did not declare 't/lib/dprof/MD5SUM'
MANIFEST did not declare 't/lib/locale/MD5SUM'
MANIFEST did not declare 't/lib/sample-tests/MD5SUM'
MANIFEST did not declare 't/lib/strict/MD5SUM'
MANIFEST did not declare 't/lib/warnings/MD5SUM'
MANIFEST did not declare 't/op/MD5SUM'
MANIFEST did not declare 't/pod/MD5SUM'
MANIFEST did not declare 't/pod/testpods/lib/Pod/MD5SUM'
MANIFEST did not declare 't/run/MD5SUM'
MANIFEST did not declare 't/uni/MD5SUM'
MANIFEST did not declare 't/win32/MD5SUM'
MANIFEST did not declare 't/x2p/MD5SUM'
MANIFEST did not declare 'utils/MD5SUM'
MANIFEST did not declare 'uts/MD5SUM'
MANIFEST did not declare 'vmesa/MD5SUM'
MANIFEST did not declare 'vms/MD5SUM'
MANIFEST did not declare 'vms/ext/DCLsym/MD5SUM'
MANIFEST did not declare 'vms/ext/MD5SUM'
MANIFEST did not declare 'vms/ext/Stdio/MD5SUM'
MANIFEST did not declare 'vos/MD5SUM'
MANIFEST did not declare 'win32/MD5SUM'
MANIFEST did not declare 'win32/bin/MD5SUM'
MANIFEST did not declare 'win32/ext/Win32/MD5SUM'
MANIFEST did not declare 'win32/include/MD5SUM'
MANIFEST did not declare 'win32/include/arpa/MD5SUM'
MANIFEST did not declare 'win32/include/sys/MD5SUM'
MANIFEST did not declare 'wince/MD5SUM'
MANIFEST did not declare 'wince/bin/MD5SUM'
MANIFEST did not declare 'wince/include/arpa/MD5SUM'
MANIFEST did not declare 'wince/include/sys/MD5SUM'
MANIFEST did not declare 'x2p/MD5SUM'




nntp.perl.org: Perl Programming lists via nntp and http.
Comments to Ask Bjørn Hansen at ask@perl.org | Group listing | About