develooper Front page | perl.perl5.porters | Postings from May 2004

Cygwin failures

Thread Next
From:
H.Merijn Brand
Date:
May 6, 2004 05:34
Subject:
Cygwin failures
Message ID:
20040506142843.98DB.H.M.BRAND@hccnet.nl
blead on cygwin-1.5.9

#####################

t/op/sysio.t fails on #39, because sysseek(I,-1,1) returns -1 instead of undef

#####################

t/op/taint.t fails on #150 with

ok 149
Bad system call

# test shmread
{
    unless ($ipcsysv) {
	print "ok 150 # skipped: no IPC::SysV\n";
	last;
    }
    if ($Config{'extensions'} =~ /\bIPC\/SysV\b/ && $Config{d_shm}) {
	no strict 'subs';
	my $sent = "foobar";
	my $rcvd;
	my $size = 2000;
	my $id = shmget(IPC_PRIVATE, $size, S_IRWXU);


PC09:/P/perl-current 546 $ echo $CYGWIN
ntsec binmode tty server
PC09:/P/perl-current 547 $

Maybe I should just remove the "server" from $CYGWIN. I've never got it to do
what I want anyway (I'd _like_ it to work though)


Related are these:

ext/IPC/SysV/t/ipcsysv...............SIGSYS caught.
It may be that your kernel does not have SysV IPC configured.

FAILED at test 1
ext/IPC/SysV/t/msg...................FAILED at test 0
ext/IPC/SysV/t/sem...................FAILED at test 0

#####################

lib/ExtUtils/t/Constant..............Creating library file: libExtTest.dll.a
Creating library file: libExtTest.dll.a
Creating library file: libExtTest.dll.a
Creating library file: libExtTest.dll.a
Creating library file: libExtTest.dll.a
Creating library file: libExtTest.dll.a
ok
lib/ExtUtils/t/Embed.................Info: resolving _MallocCfg_ptr by linking t
o __imp__MallocCfg_ptr (auto-import)
Info: resolving _PL_sigfpe_saved by linking to __imp__PL_sigfpe_saved (auto-impo
rt)
ok

#####################

lib/ExtUtils/t/Install...............Perl lib version (v5.8.3) doesn't match
exe
cutable version (v5.9.2) at ../../lib/Config.pm line 32.
Compilation failed in require at ../../lib/Test/Builder.pm line 18.
BEGIN failed--compilation aborted at ../../lib/Test/Builder.pm line 18.
Compilation failed in require at ../../lib/Test/More.pm line 6.
BEGIN failed--compilation aborted at ../../lib/Test/More.pm line 6.
Compilation failed in require at ../lib/ExtUtils/t/Install.t line 20.
BEGIN failed--compilation aborted at ../lib/ExtUtils/t/Install.t line 20.
FAILED at test 0


-- 
H.Merijn Brand        Amsterdam Perl Mongers (http://amsterdam.pm.org/)
using perl-5.6.1, 5.8.3, & 5.9.x, and 809 on  HP-UX 10.20 & 11.00, 11i,
   AIX 4.3, SuSE 9.0, and Win2k.           http://www.cmve.net/~merijn/
http://archives.develooper.com/daily-build@perl.org/   perl-qa@perl.org
send smoke reports to: smokers-reports@perl.org, QA: http://qa.perl.org



Thread Next


nntp.perl.org: Perl Programming lists via nntp and http.
Comments to Ask Bjørn Hansen at ask@perl.org | Group listing | About