develooper Front page | perl.perl5.porters | Postings from December 2003

Re: [perl #24550] 5.8.2 build and test failure on red hat 7.3

Thread Previous | Thread Next
From:
david nicol
Date:
December 1, 2003 18:29
Subject:
Re: [perl #24550] 5.8.2 build and test failure on red hat 7.3
Message ID:
1070332089.977.150.camel@plaza.davidnicol.com

okeydokey, repeating compilation experiment...

/home/david/perl-5.8.2/Configure -Dcc=gcc -Dprefix=/opt/perl-5.8.2
-Dmksymlinks -d

make runs a while and ends with this:


cp op.c opmini.c
`sh  cflags "optimize='-O2'" opmini.o`  -DPERL_EXTERNAL_GLOB opmini.c
	  CCCMD =  gcc -DPERL_CORE -c -fno-strict-aliasing -I/usr/local/include
-D_LARGEFILE_SOURCE -D_FILE_OFFSET_BITS=64 -I/usr/include/gdbm -O2 
-Wall
rm -f opmini.c
gcc -L/usr/local/lib -o miniperl \
    miniperlmain.o opmini.o libperl.a -lnsl -ldl -lm -lcrypt -lutil -lc 
./miniperl -w -Ilib -MExporter -e '<?>' || make minitest
make[1]: Entering directory `/home/david/perl-build_dec_1'
cp ext/re/re.pm ext/re/re.tmp && sh mv-if-diff ext/re/re.tmp lib/re.pm
make[2]: Entering directory `/home/david/perl-build_dec_1'
./miniperl -Ilib configpm configpm.tmp
make[2]: *** [lib/Config.pm] Error 9
make[2]: Leaving directory `/home/david/perl-build_dec_1'
make[1]: [minitest] Error 2 (ignored)
 
You may see some irrelevant test failures if you have been unable
to build lib/Config.pm or lib/lib.pm.
 
cd t && (rm -f perl; /bin/ln -s ../miniperl perl) \
	&&  ./perl TEST base/*.t comp/*.t cmd/*.t run/*.t io/*.t op/*.t uni/*.t
</dev/tty
make[1]: [minitest] Error 9 (ignored)
make[1]: Leaving directory `/home/david/perl-build_dec_1'
make: [extra.pods] Error 1 (ignored)
./miniperl -Ilib configpm configpm.tmp
make: *** [lib/Config.pm] Error 9





[david@plaza perl-build_dec_1]$ ./myconfig
Summary of my perl5 (revision 5.0 version 8 subversion 2) configuration:
  Platform:
    osname=linux, osvers=2.6.0-test7, archname=i686-linux
    uname='linux plaza.davidnicol.com 2.6.0-test7 #1 sun oct 19 21:46:11
cdt 2003 i686 unknown '
    config_args='-Dcc=gcc -Dprefix=/opt/perl-5.8.2 -Dmksymlinks -d'
    hint=recommended, useposix=true, d_sigaction=define
    usethreads=undef use5005threads=undef useithreads=undef
usemultiplicity=undef
    useperlio=define d_sfio=undef uselargefiles=define usesocks=undef
    use64bitint=undef use64bitall=undef uselongdouble=undef
    usemymalloc=n, bincompat5005=undef
  Compiler:
    cc='gcc', ccflags ='-fno-strict-aliasing -I/usr/local/include
-D_LARGEFILE_SOURCE -D_FILE_OFFSET_BITS=64 -I/usr/include/gdbm',
    optimize='-O2',
    cppflags='-fno-strict-aliasing -I/usr/local/include
-I/usr/include/gdbm'
    ccversion='', gccversion='2.96 20000731 (Red Hat Linux 7.2
2.96-112.7.2)', gccosandvers=''
    intsize=4, longsize=4, ptrsize=4, doublesize=8, byteorder=1234
    d_longlong=define, longlongsize=8, d_longdbl=define, longdblsize=12
    ivtype='long', ivsize=4, nvtype='double', nvsize=8, Off_t='off_t',
lseeksize=8
    alignbytes=4, prototype=define
  Linker and Libraries:
    ld='gcc', ldflags =' -L/usr/local/lib'
    libpth=/usr/local/lib /lib /usr/lib
    libs=-lnsl -lndbm -lgdbm -ldl -lm -lcrypt -lutil -lc
    perllibs=-lnsl -ldl -lm -lcrypt -lutil -lc
    libc=/lib/libc-2.2.4.so, so=so, useshrplib=false, libperl=libperl.a
    gnulibc_version='2.2.4'
  Dynamic Linking:
    dlsrc=dl_dlopen.xs, dlext=so, d_dlsymun=undef, ccdlflags='-rdynamic'
    cccdlflags='-fpic', lddlflags='-shared -L/usr/local/lib'




On Sat, 2003-11-29 at 12:43, Nicholas Clark via RT wrote:
> On Tue, Nov 25, 2003 at 07:47:28AM -0000, david nicol wrote:
> 
> > -----------------------------------------------------------------
> > [Please enter your report here]
> > 
> > The report is on 5.8.2, that it does not compile and test.
> > 
> > this was the end of it.
> > 
> > Not being able to run 'make test' at all seems more than
> > 'some irrelevant test failures.'
> 
> I agree
> 
> 
> > make[1]: Entering directory `/home/david/nov25Build'
> > cp ext/re/re.pm ext/re/re.tmp && sh mv-if-diff ext/re/re.tmp lib/re.pm
> > make[2]: Entering directory `/home/david/nov25Build'
> > ./miniperl -Ilib configpm configpm.tmp
> > make[2]: *** [lib/Config.pm] Error 9
> > make[2]: Leaving directory `/home/david/nov25Build'
> > make[1]: [minitest] Error 2 (ignored)
> 
> Please could you run ./myconfig in the directory of the failed build,
> and send its output.
> 
> Nicholas Clark
> 
-- 
david nicol "I'll be working, working; but if you come visit I'll
put down what I'm doing: my friends are important" -- David Byrne


Thread Previous | Thread Next


nntp.perl.org: Perl Programming lists via nntp and http.
Comments to Ask Bjørn Hansen at ask@perl.org | Group listing | About