develooper Front page | perl.perl5.porters | Postings from September 2003

[perl #23791] Many errors in build under NCR MP-RAS

From:
perlbug-followup
Date:
September 12, 2003 11:20
Subject:
[perl #23791] Many errors in build under NCR MP-RAS
Message ID:
rt-23791-64525.1.75633069574317@rt.perl.org
# New Ticket Created by  grommel@sears.com 
# Please include the string:  [perl #23791]
# in the subject line of all future correspondence about this issue. 
# <URL: http://rt.perl.org/rt2/Ticket/Display.html?id=23791 >


To: perlbug@perl.org
Subject: Many errors in build under NCR MP-RAS
Cc: sthill@sears.com
Reply-To: grommel@sears.com
Message-Id: <5.6.1_19045_1063309442@s17a105>

This is a bug report for perl from grommel@sears.com,
generated with the help of perlbug 1.34 running under perl v5.6.1.


-----------------------------------------------------------------
[Please enter your report here]

I am trying to build perl-5.8.1-RC4 under NCR MP-RAS. In previous
versions, we have encountered a few errors, but they didn't trouble
us. In this version, the errors are more numerous and more
serious; some even affect core perl functions such as 'pack'.

~~~~~~~~
This is the version of RC4:
--------------
Version v5.8.1          Maintenance release working toward v5.8.1
--------------
____________________________________________________________________________
[ 20357] By: jhi                                   on 2003/07/30  18:19:52
        Log: Integrate:
             [ 20355]

~~~~~~~~
The only change I made to the RC4 distribution was to change the
test for MP-RAS in hints/svr4.sh, thus:

142c142,148
< #       foo foo 4.0 3.0 4400 pentium ii(tm)-isapci '
---
> #       foo foo 4.0 3.0 4400 pentium ii(tm)-isapci
> #--- W. Geoffrey Rommel, 2003-09-09: I have talked to a developer
> #--- at NCR, and there seems to be no reliable way to make sure
> #--- that this is really MP-RAS. It's not in uname, it's not in
> #--- the kernel, it's not in sysinfo ... so we punt by looking
> #--- for the two files named below. These seem to be on MP-RAS
> #--- but not on other systems. Hi ho.
145,146c151,155
< case "$myuname" in
< *3441*|*4400*isapci)
---
> ##case "$myuname" in
> ##*3441*|SHG|*4400*isapci)
> if [ -f /etc/.relid -a -f /etc/issue ]; then
>     IS_MPRAS=1
>     export IS_MPRAS
148c157
<     # t/op/regexp.t test 461 unless we compile with optimizie=-g.
---
>     # t/op/regexp.t test 461 unless we compile with optimize=-g.
154,155c163
<     ;;
< esac
---
> fi


~~~~~~~~
Fixing these errors may require considerable familiarity with MP-RAS
(or at least SVR4) and with perl, so I am probably out of my depth.
I am sending a copy of this report to NCR in the hope that someone
there may be willing to take it on.

Configure and make run normally. The output of "make test" follows.

      AutoSplitting perl library
      LD_LIBRARY_PATH=/home/grommel/perl-5.8.1-RC4:/usr/gnu/lib/perl5 ./miniperl -Ilib -e 'use AutoSplit; \
            autosplit_lib_modules(@ARGV)' lib/*.pm
      LD_LIBRARY_PATH=/home/grommel/perl-5.8.1-RC4:/usr/gnu/lib/perl5 ./miniperl -Ilib -e 'use AutoSplit; \
            autosplit_lib_modules(@ARGV)' lib/*/*.pm
      make lib/re.pm
`lib/re.pm' is up to date.

      Making utilities

      Making DynaLoader (static_pic)

      Making Errno (nonxs)
      env LD_RUN_PATH=/usr/local/lib/perl5/5.8.1/SHG2-svr4.2/CORE /bin/cc -o perl  -L/usr/ccs/lib -L/usr/ucblib -L/usr/local/lib -L/usr/gnu/lib
perlmain.o lib/auto/DynaLoader/DynaLoader.a  libperl.so `cat ext.libs` -lsocket -lnsl -ldl -lld -lm -lcrypt -lc -lucb

      Making B (dynamic)

      Making ByteLoader (dynamic)

      Making Cwd (dynamic)

      Making Data::Dumper (dynamic)

      Making Devel::DProf (dynamic)

      Making Devel::PPPort (dynamic)

      Making Devel::Peek (dynamic)

      Making Digest::MD5 (dynamic)

      Making Encode (dynamic)

      Making Fcntl (dynamic)

      Making File::Glob (dynamic)

      Making Filter::Util::Call (dynamic)

      Making I18N::Langinfo (dynamic)

      Making IO (dynamic)

      Making IPC::SysV (dynamic)

      Making List::Util (dynamic)

      Making MIME::Base64 (dynamic)

      Making NDBM_File (dynamic)

      Making ODBM_File (dynamic)

      Making Opcode (dynamic)

      Making POSIX (dynamic)

      Making PerlIO::encoding (dynamic)

      Making PerlIO::scalar (dynamic)

      Making PerlIO::via (dynamic)

      Making SDBM_File (dynamic)

      Making Socket (dynamic)

      Making Storable (dynamic)

      Making Sys::Hostname (dynamic)

      Making Sys::Syslog (dynamic)

      Making Time::HiRes (dynamic)

      Making Unicode::Normalize (dynamic)

      Making XS::APItest (dynamic)

      Making XS::Typemap (dynamic)

      Making attrs (dynamic)

      Making re (dynamic)

      Making threads (dynamic)

      Making threads::shared (dynamic)
      PERL=./perl make _test_prep
      cd t && (rm -f ./perl; /usr/bin/ln -s .././perl ./perl)
      PERL=./perl make _test
      if (true </dev/tty) >/dev/null 2>&1; then \
        make TEST_ARGS= TESTFILE=TEST _test_tty   ; \
      else \
        make TEST_ARGS= TESTFILE=TEST _test_notty ; \
      fi
      cd t &&  LD_LIBRARY_PATH=/home/grommel/perl-5.8.1-RC4:/usr/gnu/lib/perl5 ./perl TEST  </dev/tty
t/base/cond..........................ok
t/base/if............................ok
t/base/lex...........................ok
t/base/num...........................ok
t/base/pat...........................ok
t/base/rs............................ok
t/base/term..........................ok
t/comp/bproto........................ok
t/comp/cmdopt........................ok
t/comp/colon.........................ok
t/comp/cpp...........................ok
t/comp/decl..........................ok
t/comp/hints.........................ok
t/comp/multiline.....................ok
t/comp/our...........................ok
t/comp/package.......................ok
t/comp/parser........................ok
t/comp/proto.........................ok
t/comp/redef.........................ok
t/comp/require.......................ok
t/comp/script........................ok
t/comp/term..........................ok
t/comp/use...........................ok
t/cmd/elsif..........................ok
t/cmd/for............................ok
t/cmd/mod............................ok
t/cmd/subval.........................ok
t/cmd/switch.........................ok
t/cmd/while..........................ok
t/run/exit...........................ok
t/run/fresh_perl.....................ok
t/run/noswitch.......................ok
t/run/runenv.........................ok
t/run/switchC........................ok
t/run/switchF........................ok
t/run/switchI........................ok
t/run/switchPx.......................ok
t/run/switcha........................ok
t/run/switchd........................ok
t/run/switches.......................ok
t/run/switchn........................ok
t/run/switchp........................ok
t/run/switcht........................ok
t/run/switchx........................ok
t/io/argv............................ok
t/io/binmode.........................ok
t/io/crlf............................ok
t/io/dup.............................ok
t/io/fflush..........................ok
t/io/fs..............................ok
t/io/inplace.........................ok
t/io/iprefix.........................ok
t/io/layers..........................ok
t/io/nargv...........................ok
t/io/open............................ok
t/io/openpid.........................ok
t/io/pipe............................ok
t/io/print...........................ok
t/io/read............................ok
t/io/tell............................ok
t/io/utf8............................ok
t/op/64bitint........................skipping test on this platform
t/op/alarm...........................ok
t/op/anonsub.........................ok
t/op/append..........................ok
t/op/args............................ok
t/op/arith...........................ok
t/op/array...........................ok
t/op/assignwarn......................ok
t/op/attrs...........................ok
t/op/auto............................ok
t/op/avhv............................ok
t/op/bless...........................ok
t/op/bop.............................ok
t/op/caller..........................ok
t/op/chars...........................ok
t/op/chdir...........................ok
t/op/chop............................ok
t/op/closure.........................ok
t/op/cmp.............................ok
t/op/concat..........................ok
t/op/cond............................ok
t/op/context.........................ok
t/op/crypt...........................substr outside of string at op/crypt.t line 33.
substr outside of string at op/crypt.t line 33.
Use of uninitialized value in string ne at op/crypt.t line 33.
Use of uninitialized value in string ne at op/crypt.t line 33.
# Failed at op/crypt.t line 33
FAILED at test 1
t/op/defins..........................ok
t/op/delete..........................ok
t/op/die.............................ok
t/op/die_exit........................ok
t/op/do..............................ok
t/op/each............................ok
t/op/eval............................ok
t/op/exec............................ok
t/op/exists_sub......................ok
t/op/exp.............................ok
t/op/fh..............................ok
t/op/filetest........................ok
t/op/flip............................ok
t/op/fork............................ok
t/op/getpid..........................skipping test on this platform
t/op/glob............................ok
t/op/gmagic..........................ok
t/op/goto............................ok
t/op/goto_xs.........................ok
t/op/grent...........................ok
t/op/grep............................ok
t/op/groups..........................ok
t/op/gv..............................ok
t/op/hashassign......................ok
t/op/hashwarn........................ok
t/op/inc.............................ok
t/op/inccode.........................ok
t/op/index...........................ok
t/op/int.............................ok
t/op/join............................ok
t/op/lc..............................ok
t/op/lc_user.........................ok
t/op/length..........................ok
t/op/lex_assign......................ok
t/op/lfs.............................skipping test on this platform
t/op/list............................ok
t/op/local...........................ok
t/op/localref........................ok
t/op/loopctl.........................ok
t/op/lop.............................ok
t/op/magic...........................ok
t/op/method..........................ok
t/op/mkdir...........................ok
t/op/my..............................ok
t/op/my_stash........................ok
t/op/nothr5005.......................ok
t/op/numconvert......................ok
t/op/oct.............................ok
t/op/or..............................ok
t/op/ord.............................ok
t/op/override........................ok
t/op/pack............................# Failed at op/pack.t line 199
#      got ''
# expected /(?-xism:^Cannot compress integer)/
FAILED at test 39
t/op/pat.............................ok
t/op/pos.............................ok
t/op/pow.............................ok
t/op/push............................ok
t/op/pwent...........................ok
t/op/qq..............................ok
t/op/quotemeta.......................ok
t/op/rand............................ok
t/op/range...........................ok
t/op/read............................ok
t/op/readdir.........................ok
t/op/readline........................ok
t/op/recurse.........................ok
t/op/ref.............................ok
t/op/regexp..........................ok
t/op/regexp_noamp....................ok
t/op/regmesg.........................ok
t/op/repeat..........................ok
t/op/reverse.........................ok
t/op/runlevel........................ok
t/op/sleep...........................ok
t/op/sort............................ok
t/op/splice..........................ok
t/op/split...........................ok
t/op/sprintf.........................ok
t/op/srand...........................ok
t/op/stash...........................ok
t/op/stat............................# Failed at op/stat.t line 255
#      got '1'
# expected '18'
# Failed at op/stat.t line 255
#      got '130'
# expected '1150'
FAILED at test 32
t/op/study...........................ok
t/op/sub_lval........................ok
t/op/subst...........................ok
t/op/subst_amp.......................ok
t/op/subst_wamp......................ok
t/op/substr..........................ok
t/op/sysio...........................ok
t/op/taint...........................ok
t/op/tie.............................ok
t/op/tiearray........................ok
t/op/tiehandle.......................ok
t/op/time............................ok
t/op/tr..............................ok
t/op/undef...........................ok
t/op/universal.......................ok
t/op/unshift.........................ok
t/op/utf8decode......................ok
t/op/utfhash.........................ok
t/op/vec.............................ok
t/op/ver.............................ok
t/op/wantarray.......................ok
t/op/write...........................ok
t/uni/fold...........................ok
t/uni/lower..........................ok
t/uni/sprintf........................ok
t/uni/title..........................ok
t/uni/tr_7jis........................ok
t/uni/tr_eucjp.......................ok
t/uni/tr_sjis........................ok
t/uni/tr_utf8........................ok
t/uni/upper..........................ok
t/uni/write..........................ok
t/lib/1_compile......................ok
t/lib/commonsense....................ok
ext/attrs/t/attrs....................ok
ext/B/t/asmdata......................ok
ext/B/t/assembler....................ok
ext/B/t/b............................ok
ext/B/t/bblock.......................ok
ext/B/t/concise......................ok
ext/B/t/debug........................ok
ext/B/t/deparse......................ok
ext/B/t/lint.........................ok
ext/B/t/o............................ok
ext/B/t/showlex......................ok
ext/B/t/stash........................ok
ext/B/t/terse........................ok
ext/B/t/xref.........................ok
ext/Cwd/t/cwd........................ok
ext/Cwd/t/taint......................ok
ext/Data/Dumper/t/dumper.............ok
ext/Data/Dumper/t/overload...........ok
ext/Data/Dumper/t/pair...............ok
ext/DB_File/t/db-btree...............skipping test on this platform
ext/DB_File/t/db-hash................skipping test on this platform
ext/DB_File/t/db-recno...............skipping test on this platform
ext/Devel/DProf/t/DProf..............ok
ext/Devel/Peek/t/Peek................ok
ext/Devel/PPPort/t/test..............ok
ext/Digest/MD5/t/align...............ok
ext/Digest/MD5/t/badfile.............ok
ext/Digest/MD5/t/clone...............ok
ext/Digest/MD5/t/files...............ok
ext/Digest/MD5/t/md5-aaa.............ok
ext/Digest/MD5/t/utf8................ok
ext/Encode/t/Aliases.................ok
ext/Encode/t/at-cn...................ok
ext/Encode/t/at-tw...................ok
ext/Encode/t/CJKT....................ok
ext/Encode/t/Encode..................ok
ext/Encode/t/Encoder.................ok
ext/Encode/t/encoding................ok
ext/Encode/t/enc_data................ok
ext/Encode/t/enc_eucjp...............ok
ext/Encode/t/enc_module..............ok
ext/Encode/t/enc_utf8................ok
ext/Encode/t/fallback................ok
ext/Encode/t/grow....................ok
ext/Encode/t/guess...................ok
ext/Encode/t/jperl...................ok
ext/Encode/t/mime-header.............ok
ext/Encode/t/perlio..................ok
ext/Encode/t/Unicode.................ok
ext/Errno/t/Errno....................ok
ext/Fcntl/t/fcntl....................ok
ext/Fcntl/t/syslfs...................skipping test on this platform
ext/File/Glob/t/basic................ok
ext/File/Glob/t/case.................ok
ext/File/Glob/t/global...............ok
ext/File/Glob/t/taint................ok
ext/Filter/t/call....................ok
ext/GDBM_File/t/gdbm.................skipping test on this platform
ext/I18N/Langinfo/t/Langinfo.........Can't load '../lib/auto/POSIX/POSIX.so' for module POSIX: dynamic linker: ./perl: relocation error: symbol not
found: _mwoflocheckl
resolving symbol in ../lib/auto/POSIX/POSIX.so at ../lib/XSLoader.pm line 83.
 at ../lib/POSIX.pm line 26
Compilation failed in require at ../ext/I18N/Langinfo/t/Langinfo.t line 16.
BEGIN failed--compilation aborted at ../ext/I18N/Langinfo/t/Langinfo.t line 16.
FAILED at test 0
ext/IO/t/IO..........................ok
ext/IO/t/io_const....................ok
ext/IO/t/io_dir......................ok
ext/IO/t/io_dup......................ok
ext/IO/t/io_linenum..................ok
ext/IO/t/io_multihomed...............ok
ext/IO/t/io_pipe.....................ok
ext/IO/t/io_poll.....................ok
ext/IO/t/io_sel......................ok
ext/IO/t/io_sock.....................ok
ext/IO/t/io_taint....................ok
ext/IO/t/io_tell.....................ok
ext/IO/t/io_udp......................ok
ext/IO/t/io_unix.....................ok
ext/IO/t/io_utf8.....................ok
ext/IO/t/io_xs.......................ok
ext/IPC/SysV/t/ipcsysv...............ok
ext/IPC/SysV/t/msg...................ok
ext/IPC/SysV/t/sem...................ok
ext/List/Util/t/blessed..............ok
ext/List/Util/t/dualvar..............ok
ext/List/Util/t/first................ok
ext/List/Util/t/isvstring............ok
ext/List/Util/t/lln..................ok
ext/List/Util/t/max..................ok
ext/List/Util/t/maxstr...............ok
ext/List/Util/t/min..................ok
ext/List/Util/t/minstr...............ok
ext/List/Util/t/openhan..............ok
ext/List/Util/t/proto................ok
ext/List/Util/t/readonly.............ok
ext/List/Util/t/reduce...............ok
ext/List/Util/t/refaddr..............ok
ext/List/Util/t/reftype..............ok
ext/List/Util/t/shuffle..............ok
ext/List/Util/t/sum..................ok
ext/List/Util/t/tainted..............ok
ext/List/Util/t/weak.................ok
ext/MIME/Base64/t/base64.............ok
ext/MIME/Base64/t/quoted-print.......ok
ext/MIME/Base64/t/unicode............ok
ext/NDBM_File/t/ndbm.................ok
ext/ODBM_File/t/odbm.................ok
ext/Opcode/t/Opcode..................ok
ext/Opcode/t/ops.....................ok
ext/PerlIO/t/encoding................ok
ext/PerlIO/t/fail....................ok
ext/PerlIO/t/fallback................ok
ext/PerlIO/t/open....................ok
ext/PerlIO/t/PerlIO..................ok
ext/PerlIO/t/scalar..................ok
ext/PerlIO/t/via.....................ok
ext/POSIX/t/is.......................Can't load '../lib/auto/POSIX/POSIX.so' for module POSIX: dynamic linker: ./perl: relocation error: symbol not
found: _mwoflocheckl
resolving symbol in ../lib/auto/POSIX/POSIX.so at ../lib/XSLoader.pm line 83.
 at ../lib/POSIX.pm line 26
Compilation failed in require at ../ext/POSIX/t/is.t line 13.
BEGIN failed--compilation aborted at ../ext/POSIX/t/is.t line 13.
FAILED at test 0
ext/POSIX/t/posix....................Can't load '../lib/auto/POSIX/POSIX.so' for module POSIX: dynamic linker: ./perl: relocation error: symbol not
found: _mwoflocheckl
resolving symbol in ../lib/auto/POSIX/POSIX.so at ../lib/XSLoader.pm line 83.
 at ../lib/POSIX.pm line 26
Compilation failed in require at ../ext/POSIX/t/posix.t line 17.
BEGIN failed--compilation aborted at ../ext/POSIX/t/posix.t line 17.
FAILED at test 0
ext/POSIX/t/sigaction................skipping test on this platform
ext/POSIX/t/taint....................Can't load '../lib/auto/POSIX/POSIX.so' for module POSIX: dynamic linker: ./perl: relocation error: symbol not
found: _mwoflocheckl
resolving symbol in ../lib/auto/POSIX/POSIX.so at ../lib/XSLoader.pm line 83.
 at ../lib/POSIX.pm line 26
Compilation failed in require at ../ext/POSIX/t/taint.t line 17.
BEGIN failed--compilation aborted at ../ext/POSIX/t/taint.t line 17.
# Looks like your test died before it could output anything.
FAILED at test 1
ext/POSIX/t/waitpid..................skipping test on this platform
ext/re/t/re..........................ok
ext/Safe/t/safe1.....................ok
ext/Safe/t/safe2.....................ok
ext/Safe/t/safe3.....................Can't load '../lib/auto/POSIX/POSIX.so' for module POSIX: dynamic linker: ./perl: relocation error: symbol not
found: _mwoflocheckl
resolving symbol in ../lib/auto/POSIX/POSIX.so at ../lib/XSLoader.pm line 83.
 at ../lib/POSIX.pm line 26
Compilation failed in require at ../ext/Safe/t/safe3.t line 20.
BEGIN failed--compilation aborted at ../ext/Safe/t/safe3.t line 20.
FAILED at test 0
ext/SDBM_File/t/sdbm.................ok
ext/Socket/t/Socket..................ok
ext/Socket/t/socketpair..............ok
ext/Storable/t/blessed...............ok
ext/Storable/t/canonical.............ok
ext/Storable/t/code..................ok
ext/Storable/t/compat06..............ok
ext/Storable/t/croak.................ok
ext/Storable/t/dclone................ok
ext/Storable/t/downgrade.............ok
ext/Storable/t/forgive...............ok
ext/Storable/t/freeze................ok
ext/Storable/t/integer...............ok
ext/Storable/t/interwork56...........skipping test on this platform
ext/Storable/t/lock..................ok
ext/Storable/t/malice................ok
ext/Storable/t/overload..............ok
ext/Storable/t/recurse...............ok
ext/Storable/t/restrict..............ok
ext/Storable/t/retrieve..............ok
ext/Storable/t/store.................ok
ext/Storable/t/tied..................ok
ext/Storable/t/tied_hook.............ok
ext/Storable/t/tied_items............ok
ext/Storable/t/utf8..................ok
ext/Storable/t/utf8hash..............ok
ext/Sys/Hostname/t/Hostname..........ok
ext/Sys/Syslog/t/syslog..............unix dgram connect: Socket operation on non-socket at ../ext/Sys/Syslog/t/syslog.t line 56
ok
ext/Thread/thr5005...................skipping test on this platform
ext/threads/shared/t/0nothread.......skipping test on this platform
ext/threads/shared/t/av_refs.........skipping test on this platform
ext/threads/shared/t/av_simple.......skipping test on this platform
ext/threads/shared/t/cond............skipping test on this platform
ext/threads/shared/t/disabled........ok
ext/threads/shared/t/hv_refs.........skipping test on this platform
ext/threads/shared/t/hv_simple.......skipping test on this platform
ext/threads/shared/t/no_share........skipping test on this platform
ext/threads/shared/t/shared_attr.....skipping test on this platform
ext/threads/shared/t/sv_refs.........skipping test on this platform
ext/threads/shared/t/sv_simple.......skipping test on this platform
ext/threads/t/basic..................skipping test on this platform
ext/threads/t/end....................skipping test on this platform
ext/threads/t/join...................skipping test on this platform
ext/threads/t/libc...................skipping test on this platform
ext/threads/t/list...................skipping test on this platform
ext/threads/t/problems...............skipping test on this platform
ext/threads/t/stress_cv..............skipping test on this platform
ext/threads/t/stress_re..............skipping test on this platform
ext/threads/t/stress_string..........skipping test on this platform
ext/threads/t/thread.................skipping test on this platform
ext/Time/HiRes/t/HiRes...............dynamic linker: ./perl: symbol not found: usleep

FAILED at test 7
ext/Unicode/Normalize/t/func.........ok
ext/Unicode/Normalize/t/norm.........ok
ext/Unicode/Normalize/t/test.........ok
ext/XS/APItest/t/printf..............ok
ext/XS/Typemap/t/Typemap.............ok
lib/AnyDBM_File......................ok
lib/Attribute/Handlers/t/multi.......ok
lib/AutoLoader.......................ok
lib/AutoSplit........................ok
lib/autouse..........................ok
lib/Benchmark........................ok
lib/bigfloatpl.......................ok
lib/bigintpl.........................ok
lib/bignum/t/bigint..................ok
lib/bignum/t/bignum..................ok
lib/bignum/t/bigrat..................ok
lib/bignum/t/biinfnan................ok
lib/bignum/t/bninfnan................ok
lib/bignum/t/bn_lite.................ok
lib/bignum/t/brinfnan................ok
lib/bignum/t/br_lite.................ok
lib/bignum/t/option_a................ok
lib/bignum/t/option_l................ok
lib/bignum/t/option_p................ok
lib/blib.............................ok
lib/bytes............................ok
lib/Carp.............................ok
lib/CGI/t/apache.....................ok
lib/CGI/t/carp.......................ok
lib/CGI/t/cookie.....................Can't load '../lib/auto/POSIX/POSIX.so' for module POSIX: dynamic linker: ./perl: relocation error: symbol not
found: _mwoflocheckl
resolving symbol in ../lib/auto/POSIX/POSIX.so at ../lib/XSLoader.pm line 83.
 at ../lib/POSIX.pm line 26
Compilation failed in require at ../lib/CGI/t/cookie.t line 12.
BEGIN failed--compilation aborted at ../lib/CGI/t/cookie.t line 12.
# Looks like your test died before it could output anything.
FAILED at test 1
lib/CGI/t/fast.......................ok
lib/CGI/t/form.......................ok
lib/CGI/t/function...................ok
lib/CGI/t/html.......................ok
lib/CGI/t/pretty.....................ok
lib/CGI/t/push.......................ok
lib/CGI/t/request....................ok
lib/CGI/t/switch.....................ok
lib/CGI/t/util-58....................ok
lib/CGI/t/util.......................ok
lib/charnames........................ok
lib/Class/ISA/test...................ok
lib/Class/Struct.....................ok
lib/Config...........................ok
lib/constant.........................ok
lib/CPAN/t/loadme....................ok
lib/CPAN/t/mirroredby................ok
lib/CPAN/t/Nox.......................ok
lib/CPAN/t/signature.................ok
lib/CPAN/t/vcmp......................ok
lib/DB...............................ok
lib/Devel/SelfStubber................ok
lib/diagnostics......................ok
lib/Digest...........................ok
lib/DirHandle........................ok
lib/Dumpvalue........................ok
lib/English..........................ok
lib/Env/t/array......................ok
lib/Env/t/env........................ok
lib/Exporter.........................ok
lib/ExtUtils/t/00compile.............ok
lib/ExtUtils/t/00setup_dummy.........ok
lib/ExtUtils/t/backwards.............ok
lib/ExtUtils/t/basic.................ok
lib/ExtUtils/t/bytes.................ok
lib/ExtUtils/t/Command...............ok
lib/ExtUtils/t/Constant..............NCR High Performance C Compiler R3.0c
(c) Copyright 1994-98, NCR Corporation
(c) Copyright 1987-98, MetaWare Incorporated
w "ExtTest.xs",L43/C5(#64):   Unreachable statement.
w "ExtTest.xs",L53/C5(#64):   Unreachable statement.
w "ExtTest.xs",L63/C5(#64):   Unreachable statement.
w "ExtTest.xs",L73/C5(#64):   Unreachable statement.
w "ExtTest.xs",L289/C5(#64):  Unreachable statement.
w "ExtTest.xs",L292/C5(#64):  Unreachable statement.
w "ExtTest.xs",L295/C5(#64):  Unreachable statement.
w "ExtTest.xs",L298/C5(#64):  Unreachable statement.
NCR High Performance C Compiler R3.0c
(c) Copyright 1994-98, NCR Corporation
(c) Copyright 1987-98, MetaWare Incorporated
w "ExtTest.xs",L151/C5(#64):  Unreachable statement.
w "ExtTest.xs",L154/C5(#64):  Unreachable statement.
NCR High Performance C Compiler R3.0c
(c) Copyright 1994-98, NCR Corporation
(c) Copyright 1987-98, MetaWare Incorporated
NCR High Performance C Compiler R3.0c
(c) Copyright 1994-98, NCR Corporation
(c) Copyright 1987-98, MetaWare Incorporated
w "ExtTest.xs",L189/C5(#64):  Unreachable statement.
NCR High Performance C Compiler R3.0c
(c) Copyright 1994-98, NCR Corporation
(c) Copyright 1987-98, MetaWare Incorporated
w "ExtTest.xs",L143/C5(#64):  Unreachable statement.
NCR High Performance C Compiler R3.0c
(c) Copyright 1994-98, NCR Corporation
(c) Copyright 1987-98, MetaWare Incorporated
w "ExtTest.xs",L143/C5(#64):  Unreachable statement.
w "ExtTest.xs",L146/C5(#64):  Unreachable statement.
ok
lib/ExtUtils/t/Embed.................NCR High Performance C Compiler R3.0c
(c) Copyright 1994-98, NCR Corporation
(c) Copyright 1987-98, MetaWare Incorporated
UX:ld: WARNING: ../libperl.so: warning: attempted multiple inclusion of file
ok
lib/ExtUtils/t/hints.................#     Failed test (../lib/ExtUtils/t/hints.t at line 36)
#          got: undef
#     expected: 'basset hounds got long ears'
#     Failed test (../lib/ExtUtils/t/hints.t at line 37)
#          got: ''
#     expected: 'Processing hints file hints/svr4.2.pl
# '
FAILED at test 1
lib/ExtUtils/t/INST..................ok
lib/ExtUtils/t/Install...............ok
lib/ExtUtils/t/Installed.............ok
lib/ExtUtils/t/INST_PREFIX...........ok
lib/ExtUtils/t/Liblist...............ok
lib/ExtUtils/t/Manifest..............ok
lib/ExtUtils/t/Mkbootstrap...........ok
lib/ExtUtils/t/MM_Any................ok
lib/ExtUtils/t/MM_BeOS...............skipping test on this platform
lib/ExtUtils/t/MM_Cygwin.............skipping test on this platform
lib/ExtUtils/t/MM_NW5................skipping test on this platform
lib/ExtUtils/t/MM_OS2................skipping test on this platform
lib/ExtUtils/t/MM_Unix...............ok
lib/ExtUtils/t/MM_VMS................skipping test on this platform
lib/ExtUtils/t/MM_Win32..............skipping test on this platform
lib/ExtUtils/t/oneliner..............ok
lib/ExtUtils/t/Packlist..............ok
lib/ExtUtils/t/postamble.............ok
lib/ExtUtils/t/prefixify.............ok
lib/ExtUtils/t/problems..............ok
lib/ExtUtils/t/prompt................ok
lib/ExtUtils/t/recurs................ok
lib/ExtUtils/t/split_command.........ok
lib/ExtUtils/t/testlib...............ok
lib/ExtUtils/t/VERSION_FROM..........ok
lib/ExtUtils/t/vmsish................ok
lib/ExtUtils/t/writemakefile_args....ok
lib/ExtUtils/t/zz_cleanup_dummy......ok
lib/Fatal............................ok
lib/fields...........................ok
lib/File/Basename....................ok
lib/File/CheckTree...................ok
lib/File/Compare.....................ok
lib/File/Copy........................ok
lib/File/DosGlob.....................ok
lib/File/Find/t/find.................ok
lib/File/Find/t/taint................ok
lib/File/Path........................ok
lib/File/Spec/t/Functions............ok
lib/File/Spec/t/rel2abs2rel..........ok
lib/File/Spec/t/Spec.................ok
lib/File/stat........................ok
lib/File/Temp/t/mktemp...............ok
lib/File/Temp/t/posix................ok
lib/File/Temp/t/security.............FAILED at test 14
lib/File/Temp/t/tempfile.............ok
lib/FileCache/t/01open...............ok
lib/FileCache/t/02maxopen............ok
lib/FileCache/t/03append.............ok
lib/FileCache/t/04twoarg.............ok
lib/FileCache/t/05override...........ok
lib/FileHandle.......................ok
lib/filetest.........................ok
lib/Filter/Simple/t/data.............ok
lib/Filter/Simple/t/export...........ok
lib/Filter/Simple/t/filter...........ok
lib/Filter/Simple/t/filter_only......ok
lib/Filter/Simple/t/import...........ok
lib/FindBin..........................ok
lib/Getopt/Long/t/gol-basic..........ok
lib/Getopt/Long/t/gol-compat.........ok
lib/Getopt/Long/t/gol-linkage........ok
lib/Getopt/Long/t/gol-oo.............ok
lib/Getopt/Std.......................ok
lib/h2ph.............................ok
lib/h2xs.............................ok
lib/Hash/Util........................ok
lib/I18N/Collate.....................Can't load '../lib/auto/POSIX/POSIX.so' for module POSIX: dynamic linker: ./perl: relocation error: symbol not
found: _mwoflocheckl
resolving symbol in ../lib/auto/POSIX/POSIX.so at ../lib/XSLoader.pm line 83.
 at ../lib/POSIX.pm line 26
Compilation failed in require at ../lib/I18N/Collate.pm line 113.
BEGIN failed--compilation aborted at ../lib/I18N/Collate.pm line 113.
Compilation failed in require at ../lib/I18N/Collate.t line 15.
BEGIN failed--compilation aborted at ../lib/I18N/Collate.t line 15.
FAILED at test 0
lib/I18N/LangTags/t/01test...........ok
lib/if...............................ok
lib/integer..........................ok
lib/Internals........................ok
lib/IPC/Open2........................ok
lib/IPC/Open3........................ok
lib/IPC/SysV.........................ok
lib/less.............................ok

lib/lib..............................ok
lib/locale...........................ok
lib/Locale/Codes/t/all...............ok
lib/Locale/Codes/t/constants.........ok
lib/Locale/Codes/t/country...........ok
lib/Locale/Codes/t/currency..........ok
lib/Locale/Codes/t/languages.........ok
lib/Locale/Codes/t/rename............ok
lib/Locale/Codes/t/script............ok
lib/Locale/Codes/t/uk................ok
lib/Locale/Maketext/t/00about........ok
lib/Locale/Maketext/t/01make.........ok
lib/Locale/Maketext/t/02get..........ok
lib/Locale/Maketext/t/03http.........ok
lib/Locale/Maketext/t/90utf8.........ok
lib/Math/BigInt/t/bare_mbf...........ok
lib/Math/BigInt/t/bare_mbi...........ok
lib/Math/BigInt/t/bare_mif...........ok
lib/Math/BigInt/t/bigfltpm...........ok
lib/Math/BigInt/t/bigintc............ok
lib/Math/BigInt/t/bigintpm...........ok
lib/Math/BigInt/t/bigints............ok
lib/Math/BigInt/t/biglog.............ok
lib/Math/BigInt/t/calling............ok
lib/Math/BigInt/t/config.............ok
lib/Math/BigInt/t/constant...........ok
lib/Math/BigInt/t/downgrade..........ok
lib/Math/BigInt/t/inf_nan............ok
lib/Math/BigInt/t/isa................ok
lib/Math/BigInt/t/mbimbf.............ok
lib/Math/BigInt/t/mbi_rand...........ok
lib/Math/BigInt/t/require............ok
lib/Math/BigInt/t/req_mbf0...........ok
lib/Math/BigInt/t/req_mbf1...........ok
lib/Math/BigInt/t/req_mbfa...........ok
lib/Math/BigInt/t/req_mbfi...........ok
lib/Math/BigInt/t/req_mbfn...........ok
lib/Math/BigInt/t/req_mbfw...........ok
lib/Math/BigInt/t/sub_mbf............ok
lib/Math/BigInt/t/sub_mbi............ok
lib/Math/BigInt/t/sub_mif............ok
lib/Math/BigInt/t/trap...............ok
lib/Math/BigInt/t/upgrade............ok
lib/Math/BigInt/t/upgradef...........ok
lib/Math/BigInt/t/use................ok
lib/Math/BigInt/t/use_lib1...........ok
lib/Math/BigInt/t/use_lib2...........ok
lib/Math/BigInt/t/use_lib3...........ok
lib/Math/BigInt/t/use_lib4...........ok
lib/Math/BigInt/t/use_mbfw...........ok
lib/Math/BigInt/t/with_sub...........ok
lib/Math/BigRat/t/bigfltrt...........ok
lib/Math/BigRat/t/bigrat.............ok
lib/Math/BigRat/t/bigratpm...........ok
lib/Math/BigRat/t/bigratup...........ok
lib/Math/BigRat/t/big_ap.............ok
lib/Math/BigRat/t/requirer...........ok
lib/Math/BigRat/t/trap...............ok
lib/Math/Complex.....................ok
lib/Math/Trig........................ok
lib/Memoize/t/array..................ok
lib/Memoize/t/array_confusion........ok
lib/Memoize/t/correctness............ok
lib/Memoize/t/errors.................ok
lib/Memoize/t/expfile................ok
lib/Memoize/t/expire.................ok
lib/Memoize/t/expmod_n...............ok
lib/Memoize/t/expmod_t...............ok
lib/Memoize/t/flush..................ok
lib/Memoize/t/normalize..............ok
lib/Memoize/t/prototype..............ok
lib/Memoize/t/speed..................ok
lib/Memoize/t/tie....................ok
lib/Memoize/t/tiefeatures............ok
lib/Memoize/t/tie_gdbm...............skipping test on this platform
lib/Memoize/t/tie_ndbm...............ok
lib/Memoize/t/tie_sdbm...............ok
lib/Memoize/t/tie_storable...........ok
lib/Memoize/t/unmemoize..............ok
lib/Net/hostent......................ok
lib/Net/netent.......................ok
lib/Net/Ping/t/100_load..............Can't load '../lib/auto/POSIX/POSIX.so' for module POSIX: dynamic linker: ./perl: relocation error: symbol not
found: _mwoflocheckl
resolving symbol in ../lib/auto/POSIX/POSIX.so at ../lib/XSLoader.pm line 83.
 at ../lib/POSIX.pm line 26
Compilation failed in require at ../lib/Net/Ping.pm line 13.
BEGIN failed--compilation aborted at ../lib/Net/Ping.pm line 13.
Compilation failed in require at ../lib/Net/Ping/t/100_load.t line 18.
BEGIN failed--compilation aborted at ../lib/Net/Ping/t/100_load.t line 18.
# Failed test 1 in ../lib/Net/Ping/t/100_load.t at line 15
#  ../lib/Net/Ping/t/100_load.t line 15 is: END { ok $loaded;}
FAILED at test 1
lib/Net/Ping/t/110_icmp_inst.........Can't load '../lib/auto/POSIX/POSIX.so' for module POSIX: dynamic linker: ./perl: relocation error: symbol not
found: _mwoflocheckl
resolving symbol in ../lib/auto/POSIX/POSIX.so at ../lib/XSLoader.pm line 83.
 at ../lib/POSIX.pm line 26
Compilation failed in require at ../lib/Net/Ping.pm line 13.
BEGIN failed--compilation aborted at ../lib/Net/Ping.pm line 13.
Compilation failed in require at ../lib/Net/Ping/t/110_icmp_inst.t line 12.
BEGIN failed--compilation aborted at ../lib/Net/Ping/t/110_icmp_inst.t line 12.
FAILED at test 0
lib/Net/Ping/t/120_udp_inst..........Can't load '../lib/auto/POSIX/POSIX.so' for module POSIX: dynamic linker: ./perl: relocation error: symbol not
found: _mwoflocheckl
resolving symbol in ../lib/auto/POSIX/POSIX.so at ../lib/XSLoader.pm line 83.
 at ../lib/POSIX.pm line 26
Compilation failed in require at ../lib/Net/Ping.pm line 13.
BEGIN failed--compilation aborted at ../lib/Net/Ping.pm line 13.
Compilation failed in require at ../lib/Net/Ping/t/120_udp_inst.t line 16.
BEGIN failed--compilation aborted at ../lib/Net/Ping/t/120_udp_inst.t line 16.
FAILED at test 0
lib/Net/Ping/t/130_tcp_inst..........Can't load '../lib/auto/POSIX/POSIX.so' for module POSIX: dynamic linker: ./perl: relocation error: symbol not
found: _mwoflocheckl
resolving symbol in ../lib/auto/POSIX/POSIX.so at ../lib/XSLoader.pm line 83.
 at ../lib/POSIX.pm line 26
Compilation failed in require at ../lib/Net/Ping.pm line 13.
BEGIN failed--compilation aborted at ../lib/Net/Ping.pm line 13.
Compilation failed in require at ../lib/Net/Ping/t/130_tcp_inst.t line 15.
BEGIN failed--compilation aborted at ../lib/Net/Ping/t/130_tcp_inst.t line 15.
FAILED at test 0
lib/Net/Ping/t/140_stream_inst.......Can't load '../lib/auto/POSIX/POSIX.so' for module POSIX: dynamic linker: ./perl: relocation error: symbol not
found: _mwoflocheckl
resolving symbol in ../lib/auto/POSIX/POSIX.so at ../lib/XSLoader.pm line 83.
 at ../lib/POSIX.pm line 26
Compilation failed in require at ../lib/Net/Ping.pm line 13.
BEGIN failed--compilation aborted at ../lib/Net/Ping.pm line 13.
Compilation failed in require at ../lib/Net/Ping/t/140_stream_inst.t line 15.
BEGIN failed--compilation aborted at ../lib/Net/Ping/t/140_stream_inst.t line 15.
FAILED at test 0
lib/Net/Ping/t/150_syn_inst..........Can't load '../lib/auto/POSIX/POSIX.so' for module POSIX: dynamic linker: ./perl: relocation error: symbol not
found: _mwoflocheckl
resolving symbol in ../lib/auto/POSIX/POSIX.so at ../lib/XSLoader.pm line 83.
 at ../lib/POSIX.pm line 26
Compilation failed in require at ../lib/Net/Ping.pm line 13.
BEGIN failed--compilation aborted at ../lib/Net/Ping.pm line 13.
Compilation failed in require at ../lib/Net/Ping/t/150_syn_inst.t line 15.
BEGIN failed--compilation aborted at ../lib/Net/Ping/t/150_syn_inst.t line 15.
FAILED at test 0
lib/Net/Ping/t/190_alarm.............Can't load '../lib/auto/POSIX/POSIX.so' for module POSIX: dynamic linker: ./perl: relocation error: symbol not
found: _mwoflocheckl
resolving symbol in ../lib/auto/POSIX/POSIX.so at ../lib/XSLoader.pm line 83.
 at ../lib/POSIX.pm line 26
Compilation failed in require at ../lib/Net/Ping.pm line 13.
BEGIN failed--compilation aborted at ../lib/Net/Ping.pm line 13.
Compilation failed in require at ../lib/Net/Ping/t/190_alarm.t line 23.
BEGIN failed--compilation aborted at ../lib/Net/Ping/t/190_alarm.t line 23.
FAILED at test 0
lib/Net/Ping/t/200_ping_tcp..........skipping test on this platform
lib/Net/Ping/t/250_ping_hires........skipping test on this platform
lib/Net/Ping/t/300_ping_stream.......skipping test on this platform
lib/Net/Ping/t/400_ping_syn..........skipping test on this platform
lib/Net/Ping/t/410_syn_host..........skipping test on this platform
lib/Net/Ping/t/450_service...........Can't load '../lib/auto/POSIX/POSIX.so' for module POSIX: dynamic linker: ./perl: relocation error: symbol not
found: _mwoflocheckl
resolving symbol in ../lib/auto/POSIX/POSIX.so at ../lib/XSLoader.pm line 83.
 at ../lib/POSIX.pm line 26
Compilation failed in require at ../lib/Net/Ping.pm line 13.
BEGIN failed--compilation aborted at ../lib/Net/Ping.pm line 13.
Compilation failed in require at ../lib/Net/Ping/t/450_service.t line 16.
BEGIN failed--compilation aborted at ../lib/Net/Ping/t/450_service.t line 16.
FAILED at test 0
lib/Net/Ping/t/500_ping_icmp.........Can't load '../lib/auto/POSIX/POSIX.so' for module POSIX: dynamic linker: ./perl: relocation error: symbol not
found: _mwoflocheckl
resolving symbol in ../lib/auto/POSIX/POSIX.so at ../lib/XSLoader.pm line 83.
 at ../lib/POSIX.pm line 26
Compilation failed in require at ../lib/Net/Ping.pm line 13.
BEGIN failed--compilation aborted at ../lib/Net/Ping.pm line 13.
Compilation failed in require at ../lib/Net/Ping/t/500_ping_icmp.t line 12.
BEGIN failed--compilation aborted at ../lib/Net/Ping/t/500_ping_icmp.t line 12.
FAILED at test 0
lib/Net/Ping/t/510_ping_udp..........Can't load '../lib/auto/POSIX/POSIX.so' for module POSIX: dynamic linker: ./perl: relocation error: symbol not
found: _mwoflocheckl
resolving symbol in ../lib/auto/POSIX/POSIX.so at ../lib/XSLoader.pm line 83.
 at ../lib/POSIX.pm line 26
Compilation failed in require at ../lib/Net/Ping.pm line 13.
BEGIN failed--compilation aborted at ../lib/Net/Ping.pm line 13.
Compilation failed in require at ../lib/Net/Ping/t/510_ping_udp.t line 15.
BEGIN failed--compilation aborted at ../lib/Net/Ping/t/510_ping_udp.t line 15.
FAILED at test 0
lib/Net/protoent.....................ok
lib/Net/servent......................ok
lib/Net/t/config.....................ok
lib/Net/t/ftp........................skipping test on this platform
lib/Net/t/hostname...................ok
lib/Net/t/netrc......................ok
lib/Net/t/nntp.......................skipping test on this platform
lib/Net/t/require....................ok
lib/Net/t/smtp.......................skipping test on this platform
lib/Net/t/time.......................ok
lib/NEXT/t/actual....................ok
lib/NEXT/t/actuns....................ok
lib/NEXT/t/next......................ok
lib/NEXT/t/unseen....................ok
lib/open.............................ok
lib/overload.........................ok
lib/PerlIO/via/t/QuotedPrint.........ok
lib/ph...............................ok
lib/Pod/Perldoc/t/checkerbasic.......ok
lib/Pod/Perldoc/t/perldocbasic.......ok
lib/Pod/Perldoc/t/textbasic..........ok
lib/Pod/t/basic......................Can't load '../lib/auto/POSIX/POSIX.so' for module POSIX: dynamic linker: ./perl: relocation error: symbol not
found: _mwoflocheckl
resolving symbol in ../lib/auto/POSIX/POSIX.so at ../lib/XSLoader.pm line 83.
 at ../lib/POSIX.pm line 26
Compilation failed in require at ../lib/Pod/Text/Termcap.pm line 22.
BEGIN failed--compilation aborted at ../lib/Pod/Text/Termcap.pm line 22.
Compilation failed in require at ../lib/Pod/t/basic.t line 31.
BEGIN failed--compilation aborted at ../lib/Pod/t/basic.t line 31.
FAILED at test 1
lib/Pod/t/eol........................ok
lib/Pod/t/Functions..................ok
lib/Pod/t/htmlescp...................ok
lib/Pod/t/htmlview...................ok
lib/Pod/t/InputObjects...............ok
lib/Pod/t/man........................ok
lib/Pod/t/parselink..................ok
lib/Pod/t/pod2latex..................ok
lib/Pod/t/Select.....................ok
lib/Pod/t/text-errors................ok
lib/Pod/t/text-options...............ok
lib/Pod/t/text.......................ok
lib/Pod/t/Usage......................ok
lib/Pod/t/utils......................ok
lib/Search/Dict......................ok
lib/SelectSaver......................ok
lib/SelfLoader.......................ok
lib/Shell............................ok
lib/sigtrap..........................ok
lib/sort.............................ok
lib/strict...........................ok
lib/subs.............................ok
lib/Switch/t/given...................ok
lib/Switch/t/nested..................ok
lib/Switch/t/switch..................ok
lib/Symbol...........................ok
lib/Term/ANSIColor/test..............ok
lib/Term/Cap.........................ok
lib/Term/Complete....................ok
lib/Term/ReadLine....................ok
lib/Test/Harness/t/00compile.........ok
lib/Test/Harness/t/assert............ok
lib/Test/Harness/t/base..............ok
lib/Test/Harness/t/callback..........ok
lib/Test/Harness/t/nonumbers.........skipping test on this platform
lib/Test/Harness/t/ok................ok
lib/Test/Harness/t/pod...............skipping test on this platform
lib/Test/Harness/t/strap-analyze.....ok
lib/Test/Harness/t/strap.............ok
lib/Test/Harness/t/test-harness......ok
lib/Test/Simple/t/bad_plan...........ok
lib/Test/Simple/t/buffer.............ok
lib/Test/Simple/t/Builder............ok
lib/Test/Simple/t/curr_test..........ok
lib/Test/Simple/t/details............ok
lib/Test/Simple/t/diag...............ok
lib/Test/Simple/t/exit...............ok
lib/Test/Simple/t/extra..............ok
lib/Test/Simple/t/fail-like..........ok
lib/Test/Simple/t/fail-more..........ok
lib/Test/Simple/t/fail...............ok
lib/Test/Simple/t/filehandles........ok
lib/Test/Simple/t/fork...............ok
lib/Test/Simple/t/has_plan...........ok
lib/Test/Simple/t/has_plan2..........skipping test on this platform
lib/Test/Simple/t/import.............ok
lib/Test/Simple/t/is_deeply..........ok
lib/Test/Simple/t/maybe_regex........ok
lib/Test/Simple/t/missing............ok
lib/Test/Simple/t/More...............ok
lib/Test/Simple/t/no_ending..........ok
lib/Test/Simple/t/no_header..........ok
lib/Test/Simple/t/no_plan............ok
lib/Test/Simple/t/ok_obj.............ok
lib/Test/Simple/t/output.............ok
lib/Test/Simple/t/plan...............ok
lib/Test/Simple/t/plan_is_noplan.....skipping test on this platform
lib/Test/Simple/t/plan_no_plan.......skipping test on this platform
lib/Test/Simple/t/plan_skip_all......skipping test on this platform
lib/Test/Simple/t/simple.............ok
lib/Test/Simple/t/skip...............ok
lib/Test/Simple/t/skipall............ok
lib/Test/Simple/t/strays.............skipping test on this platform
lib/Test/Simple/t/threads............skipping test on this platform
lib/Test/Simple/t/todo...............ok
lib/Test/Simple/t/undef..............ok
lib/Test/Simple/t/useing.............ok
lib/Test/Simple/t/use_ok.............ok
lib/Test/t/fail......................ok
lib/Test/t/mix.......................ok
lib/Test/t/onfail....................ok
lib/Test/t/qr........................ok
lib/Test/t/skip......................ok
lib/Test/t/success...................ok
lib/Test/t/todo......................ok
lib/Text/Abbrev......................ok
lib/Text/Balanced/t/extbrk...........ok
lib/Text/Balanced/t/extcbk...........ok
lib/Text/Balanced/t/extdel...........ok
lib/Text/Balanced/t/extmul...........ok
lib/Text/Balanced/t/extqlk...........ok
lib/Text/Balanced/t/exttag...........ok
lib/Text/Balanced/t/extvar...........ok
lib/Text/Balanced/t/gentag...........ok
lib/Text/ParseWords..................ok
lib/Text/Soundex.....................ok
lib/Text/TabsWrap/t/fill.............ok
lib/Text/TabsWrap/t/tabs.............ok
lib/Text/TabsWrap/t/wrap.............ok
lib/Thread/Queue.....................skipping test on this platform
lib/Thread/Semaphore.................skipping test on this platform
lib/Tie/Array/push...................ok
lib/Tie/Array/splice.................ok
lib/Tie/Array/std....................ok
lib/Tie/Array/stdpush................ok
lib/Tie/File/t/00_version............Can't load '../lib/auto/POSIX/POSIX.so' for module POSIX: dynamic linker: ./perl: relocation error: symbol not
found: _mwoflocheckl
resolving symbol in ../lib/auto/POSIX/POSIX.so at ../lib/XSLoader.pm line 83.
 at ../lib/POSIX.pm line 26
Compilation failed in require at ../lib/Tie/File.pm line 5.
BEGIN failed--compilation aborted at ../lib/Tie/File.pm line 5.
Compilation failed in require at ../lib/Tie/File/t/00_version.t line 6.
BEGIN failed--compilation aborted at ../lib/Tie/File/t/00_version.t line 6.
FAILED at test 0
lib/Tie/File/t/01_gen................Can't load '../lib/auto/POSIX/POSIX.so' for module POSIX: dynamic linker: ./perl: relocation error: symbol not
found: _mwoflocheckl
resolving symbol in ../lib/auto/POSIX/POSIX.so at ../lib/XSLoader.pm line 83.
 at ../lib/POSIX.pm line 26
Compilation failed in require at ../lib/Tie/File.pm line 5.
BEGIN failed--compilation aborted at ../lib/Tie/File.pm line 5.
Compilation failed in require at ../lib/Tie/File/t/01_gen.t line 10.
BEGIN failed--compilation aborted at ../lib/Tie/File/t/01_gen.t line 10.
FAILED at test 0
lib/Tie/File/t/02_fetchsize..........Can't load '../lib/auto/POSIX/POSIX.so' for module POSIX: dynamic linker: ./perl: relocation error: symbol not
found: _mwoflocheckl
resolving symbol in ../lib/auto/POSIX/POSIX.so at ../lib/XSLoader.pm line 83.
 at ../lib/POSIX.pm line 26
Compilation failed in require at ../lib/Tie/File.pm line 5.
BEGIN failed--compilation aborted at ../lib/Tie/File.pm line 5.
Compilation failed in require at ../lib/Tie/File/t/02_fetchsize.t line 10.
BEGIN failed--compilation aborted at ../lib/Tie/File/t/02_fetchsize.t line 10.
FAILED at test 0
lib/Tie/File/t/03_longfetch..........Can't load '../lib/auto/POSIX/POSIX.so' for module POSIX: dynamic linker: ./perl: relocation error: symbol not
found: _mwoflocheckl
resolving symbol in ../lib/auto/POSIX/POSIX.so at ../lib/XSLoader.pm line 83.
 at ../lib/POSIX.pm line 26
Compilation failed in require at ../lib/Tie/File.pm line 5.
BEGIN failed--compilation aborted at ../lib/Tie/File.pm line 5.
Compilation failed in require at ../lib/Tie/File/t/03_longfetch.t line 18.
BEGIN failed--compilation aborted at ../lib/Tie/File/t/03_longfetch.t line 18.
FAILED at test 0
lib/Tie/File/t/04_splice.............Can't load '../lib/auto/POSIX/POSIX.so' for module POSIX: dynamic linker: ./perl: relocation error: symbol not
found: _mwoflocheckl
resolving symbol in ../lib/auto/POSIX/POSIX.so at ../lib/XSLoader.pm line 83.
 at ../lib/POSIX.pm line 26
Compilation failed in require at ../lib/Tie/File.pm line 5.
BEGIN failed--compilation aborted at ../lib/Tie/File.pm line 5.
Compilation failed in require at ../lib/Tie/File/t/04_splice.t line 24.
BEGIN failed--compilation aborted at ../lib/Tie/File/t/04_splice.t line 24.
FAILED at test 0
lib/Tie/File/t/05_size...............Can't load '../lib/auto/POSIX/POSIX.so' for module POSIX: dynamic linker: ./perl: relocation error: symbol not
found: _mwoflocheckl
resolving symbol in ../lib/auto/POSIX/POSIX.so at ../lib/XSLoader.pm line 83.
 at ../lib/POSIX.pm line 26
Compilation failed in require at ../lib/Tie/File/t/05_size.t line 7.
BEGIN failed--compilation aborted at ../lib/Tie/File/t/05_size.t line 7.
FAILED at test 0
lib/Tie/File/t/06_fixrec.............Can't load '../lib/auto/POSIX/POSIX.so' for module POSIX: dynamic linker: ./perl: relocation error: symbol not
found: _mwoflocheckl
resolving symbol in ../lib/auto/POSIX/POSIX.so at ../lib/XSLoader.pm line 83.
 at ../lib/POSIX.pm line 26
Compilation failed in require at ../lib/Tie/File/t/06_fixrec.t line 3.
BEGIN failed--compilation aborted at ../lib/Tie/File/t/06_fixrec.t line 3.
FAILED at test 0
lib/Tie/File/t/07_rv_splice..........Can't load '../lib/auto/POSIX/POSIX.so' for module POSIX: dynamic linker: ./perl: relocation error: symbol not
found: _mwoflocheckl
resolving symbol in ../lib/auto/POSIX/POSIX.so at ../lib/XSLoader.pm line 83.
 at ../lib/POSIX.pm line 26
Compilation failed in require at ../lib/Tie/File.pm line 5.
BEGIN failed--compilation aborted at ../lib/Tie/File.pm line 5.
Compilation failed in require at ../lib/Tie/File/t/07_rv_splice.t line 15.
BEGIN failed--compilation aborted at ../lib/Tie/File/t/07_rv_splice.t line 15.
FAILED at test 0
lib/Tie/File/t/08_ro.................Can't load '../lib/auto/POSIX/POSIX.so' for module POSIX: dynamic linker: ./perl: relocation error: symbol not
found: _mwoflocheckl
resolving symbol in ../lib/auto/POSIX/POSIX.so at ../lib/XSLoader.pm line 83.
 at ../lib/POSIX.pm line 26
Compilation failed in require at ../lib/Tie/File.pm line 5.
BEGIN failed--compilation aborted at ../lib/Tie/File.pm line 5.
Compilation failed in require at ../lib/Tie/File/t/08_ro.t line 12.
BEGIN failed--compilation aborted at ../lib/Tie/File/t/08_ro.t line 12.
FAILED at test 0
lib/Tie/File/t/09_gen_rs.............Can't load '../lib/auto/POSIX/POSIX.so' for module POSIX: dynamic linker: ./perl: relocation error: symbol not
found: _mwoflocheckl
resolving symbol in ../lib/auto/POSIX/POSIX.so at ../lib/XSLoader.pm line 83.
 at ../lib/POSIX.pm line 26
Compilation failed in require at ../lib/Tie/File.pm line 5.
BEGIN failed--compilation aborted at ../lib/Tie/File.pm line 5.
Compilation failed in require at ../lib/Tie/File/t/09_gen_rs.t line 8.
BEGIN failed--compilation aborted at ../lib/Tie/File/t/09_gen_rs.t line 8.
FAILED at test 0
lib/Tie/File/t/10_splice_rs..........Can't load '../lib/auto/POSIX/POSIX.so' for module POSIX: dynamic linker: ./perl: relocation error: symbol not
found: _mwoflocheckl
resolving symbol in ../lib/auto/POSIX/POSIX.so at ../lib/XSLoader.pm line 83.
 at ../lib/POSIX.pm line 26
Compilation failed in require at ../lib/Tie/File/t/10_splice_rs.t line 13.
BEGIN failed--compilation aborted at ../lib/Tie/File/t/10_splice_rs.t line 13.
FAILED at test 0
lib/Tie/File/t/11_rv_splice_rs.......Can't load '../lib/auto/POSIX/POSIX.so' for module POSIX: dynamic linker: ./perl: relocation error: symbol not
found: _mwoflocheckl
resolving symbol in ../lib/auto/POSIX/POSIX.so at ../lib/XSLoader.pm line 83.
 at ../lib/POSIX.pm line 26
Compilation failed in require at ../lib/Tie/File.pm line 5.
BEGIN failed--compilation aborted at ../lib/Tie/File.pm line 5.
Compilation failed in require at ../lib/Tie/File/t/11_rv_splice_rs.t line 13.
BEGIN failed--compilation aborted at ../lib/Tie/File/t/11_rv_splice_rs.t line 13.
FAILED at test 0
lib/Tie/File/t/12_longfetch_rs.......Can't load '../lib/auto/POSIX/POSIX.so' for module POSIX: dynamic linker: ./perl: relocation error: symbol not
found: _mwoflocheckl
resolving symbol in ../lib/auto/POSIX/POSIX.so at ../lib/XSLoader.pm line 83.
 at ../lib/POSIX.pm line 26
Compilation failed in require at ../lib/Tie/File.pm line 5.
BEGIN failed--compilation aborted at ../lib/Tie/File.pm line 5.
Compilation failed in require at ../lib/Tie/File/t/12_longfetch_rs.t line 15.
BEGIN failed--compilation aborted at ../lib/Tie/File/t/12_longfetch_rs.t line 15.
FAILED at test 0
lib/Tie/File/t/13_size_rs............Can't load '../lib/auto/POSIX/POSIX.so' for module POSIX: dynamic linker: ./perl: relocation error: symbol not
found: _mwoflocheckl
resolving symbol in ../lib/auto/POSIX/POSIX.so at ../lib/XSLoader.pm line 83.
 at ../lib/POSIX.pm line 26
Compilation failed in require at ../lib/Tie/File/t/13_size_rs.t line 7.
BEGIN failed--compilation aborted at ../lib/Tie/File/t/13_size_rs.t line 7.
FAILED at test 0
lib/Tie/File/t/14_lock...............Can't load '../lib/auto/POSIX/POSIX.so' for module POSIX: dynamic linker: ./perl: relocation error: symbol not
found: _mwoflocheckl
resolving symbol in ../lib/auto/POSIX/POSIX.so at ../lib/XSLoader.pm line 83.
 at ../lib/POSIX.pm line 26
Compilation failed in require at ../lib/Tie/File.pm line 5.
BEGIN failed--compilation aborted at ../lib/Tie/File.pm line 5.
Compilation failed in require at ../lib/Tie/File/t/14_lock.t line 28.
BEGIN failed--compilation aborted at ../lib/Tie/File/t/14_lock.t line 28.
FAILED at test 0
lib/Tie/File/t/15_pushpop............Can't load '../lib/auto/POSIX/POSIX.so' for module POSIX: dynamic linker: ./perl: relocation error: symbol not
found: _mwoflocheckl
resolving symbol in ../lib/auto/POSIX/POSIX.so at ../lib/XSLoader.pm line 83.
 at ../lib/POSIX.pm line 26
Compilation failed in require at ../lib/Tie/File/t/15_pushpop.t line 12.
BEGIN failed--compilation aborted at ../lib/Tie/File/t/15_pushpop.t line 12.
FAILED at test 0
lib/Tie/File/t/16_handle.............Can't load '../lib/auto/POSIX/POSIX.so' for module POSIX: dynamic linker: ./perl: relocation error: symbol not
found: _mwoflocheckl
resolving symbol in ../lib/auto/POSIX/POSIX.so at ../lib/XSLoader.pm line 83.
 at ../lib/POSIX.pm line 26
Compilation failed in require at ../lib/Tie/File.pm line 5.
BEGIN failed--compilation aborted at ../lib/Tie/File.pm line 5.
Compilation failed in require at ../lib/Tie/File/t/16_handle.t line 17.
BEGIN failed--compilation aborted at ../lib/Tie/File/t/16_handle.t line 17.
FAILED at test 0
lib/Tie/File/t/17_misc_meth..........Can't load '../lib/auto/POSIX/POSIX.so' for module POSIX: dynamic linker: ./perl: relocation error: symbol not
found: _mwoflocheckl
resolving symbol in ../lib/auto/POSIX/POSIX.so at ../lib/XSLoader.pm line 83.
 at ../lib/POSIX.pm line 26
Compilation failed in require at ../lib/Tie/File.pm line 5.
BEGIN failed--compilation aborted at ../lib/Tie/File.pm line 5.
Compilation failed in require at ../lib/Tie/File/t/17_misc_meth.t line 14.
BEGIN failed--compilation aborted at ../lib/Tie/File/t/17_misc_meth.t line 14.
FAILED at test 0
lib/Tie/File/t/18_rs_fixrec..........Can't load '../lib/auto/POSIX/POSIX.so' for module POSIX: dynamic linker: ./perl: relocation error: symbol not
found: _mwoflocheckl
resolving symbol in ../lib/auto/POSIX/POSIX.so at ../lib/XSLoader.pm line 83.
 at ../lib/POSIX.pm line 26
Compilation failed in require at ../lib/Tie/File/t/18_rs_fixrec.t line 3.
BEGIN failed--compilation aborted at ../lib/Tie/File/t/18_rs_fixrec.t line 3.
FAILED at test 0
lib/Tie/File/t/19_cache..............Can't load '../lib/auto/POSIX/POSIX.so' for module POSIX: dynamic linker: ./perl: relocation error: symbol not
found: _mwoflocheckl
resolving symbol in ../lib/auto/POSIX/POSIX.so at ../lib/XSLoader.pm line 83.
 at ../lib/POSIX.pm line 26
Compilation failed in require at ../lib/Tie/File.pm line 5.
BEGIN failed--compilation aborted at ../lib/Tie/File.pm line 5.
Compilation failed in require at ../lib/Tie/File/t/19_cache.t line 15.
BEGIN failed--compilation aborted at ../lib/Tie/File/t/19_cache.t line 15.
FAILED at test 0
lib/Tie/File/t/20_cache_full.........Can't load '../lib/auto/POSIX/POSIX.so' for module POSIX: dynamic linker: ./perl: relocation error: symbol not
found: _mwoflocheckl
resolving symbol in ../lib/auto/POSIX/POSIX.so at ../lib/XSLoader.pm line 83.
 at ../lib/POSIX.pm line 26
Compilation failed in require at ../lib/Tie/File.pm line 5.
BEGIN failed--compilation aborted at ../lib/Tie/File.pm line 5.
Compilation failed in require at ../lib/Tie/File/t/20_cache_full.t line 14.
BEGIN failed--compilation aborted at ../lib/Tie/File/t/20_cache_full.t line 14.
FAILED at test 0
lib/Tie/File/t/21_win32..............Can't load '../lib/auto/POSIX/POSIX.so' for module POSIX: dynamic linker: ./perl: relocation error: symbol not
found: _mwoflocheckl
resolving symbol in ../lib/auto/POSIX/POSIX.so at ../lib/XSLoader.pm line 83.
 at ../lib/POSIX.pm line 26
Compilation failed in require at ../lib/Tie/File.pm line 5.
BEGIN failed--compilation aborted at ../lib/Tie/File.pm line 5.
Compilation failed in require at ../lib/Tie/File/t/21_win32.t line 21.
BEGIN failed--compilation aborted at ../lib/Tie/File/t/21_win32.t line 21.
FAILED at test 0
lib/Tie/File/t/22_autochomp..........Can't load '../lib/auto/POSIX/POSIX.so' for module POSIX: dynamic linker: ./perl: relocation error: symbol not
found: _mwoflocheckl
resolving symbol in ../lib/auto/POSIX/POSIX.so at ../lib/XSLoader.pm line 83.
 at ../lib/POSIX.pm line 26
Compilation failed in require at ../lib/Tie/File.pm line 5.
BEGIN failed--compilation aborted at ../lib/Tie/File.pm line 5.
Compilation failed in require at ../lib/Tie/File/t/22_autochomp.t line 9.
BEGIN failed--compilation aborted at ../lib/Tie/File/t/22_autochomp.t line 9.
FAILED at test 0
lib/Tie/File/t/23_rv_ac_splice.......Can't load '../lib/auto/POSIX/POSIX.so' for module POSIX: dynamic linker: ./perl: relocation error: symbol not
found: _mwoflocheckl
resolving symbol in ../lib/auto/POSIX/POSIX.so at ../lib/XSLoader.pm line 83.
 at ../lib/POSIX.pm line 26
Compilation failed in require at ../lib/Tie/File.pm line 5.
BEGIN failed--compilation aborted at ../lib/Tie/File.pm line 5.
Compilation failed in require at ../lib/Tie/File/t/23_rv_ac_splice.t line 14.
BEGIN failed--compilation aborted at ../lib/Tie/File/t/23_rv_ac_splice.t line 14.
FAILED at test 0
lib/Tie/File/t/24_cache_loop.........Can't load '../lib/auto/POSIX/POSIX.so' for module POSIX: dynamic linker: ./perl: relocation error: symbol not
found: _mwoflocheckl
resolving symbol in ../lib/auto/POSIX/POSIX.so at ../lib/XSLoader.pm line 83.
 at ../lib/POSIX.pm line 26
Compilation failed in require at ../lib/Tie/File.pm line 5.
BEGIN failed--compilation aborted at ../lib/Tie/File.pm line 5.
Compilation failed in require at ../lib/Tie/File/t/24_cache_loop.t line 19.
BEGIN failed--compilation aborted at ../lib/Tie/File/t/24_cache_loop.t line 19.
FAILED at test 0
lib/Tie/File/t/25_gen_nocache........Can't load '../lib/auto/POSIX/POSIX.so' for module POSIX: dynamic linker: ./perl: relocation error: symbol not
found: _mwoflocheckl
resolving symbol in ../lib/auto/POSIX/POSIX.so at ../lib/XSLoader.pm line 83.
 at ../lib/POSIX.pm line 26
Compilation failed in require at ../lib/Tie/File.pm line 5.
BEGIN failed--compilation aborted at ../lib/Tie/File.pm line 5.
Compilation failed in require at ../lib/Tie/File/t/25_gen_nocache.t line 11.
BEGIN failed--compilation aborted at ../lib/Tie/File/t/25_gen_nocache.t line 11.
FAILED at test 0
lib/Tie/File/t/26_twrite.............Can't load '../lib/auto/POSIX/POSIX.so' for module POSIX: dynamic linker: ./perl: relocation error: symbol not
found: _mwoflocheckl
resolving symbol in ../lib/auto/POSIX/POSIX.so at ../lib/XSLoader.pm line 83.
 at ../lib/POSIX.pm line 26
Compilation failed in require at ../lib/Tie/File.pm line 5.
BEGIN failed--compilation aborted at ../lib/Tie/File.pm line 5.
Compilation failed in require at ../lib/Tie/File/t/26_twrite.t line 19.
BEGIN failed--compilation aborted at ../lib/Tie/File/t/26_twrite.t line 19.
FAILED at test 0
lib/Tie/File/t/27_iwrite.............Can't load '../lib/auto/POSIX/POSIX.so' for module POSIX: dynamic linker: ./perl: relocation error: symbol not
found: _mwoflocheckl
resolving symbol in ../lib/auto/POSIX/POSIX.so at ../lib/XSLoader.pm line 83.
 at ../lib/POSIX.pm line 26
Compilation failed in require at ../lib/Tie/File.pm line 5.
BEGIN failed--compilation aborted at ../lib/Tie/File.pm line 5.
Compilation failed in require at ../lib/Tie/File/t/27_iwrite.t line 21.
BEGIN failed--compilation aborted at ../lib/Tie/File/t/27_iwrite.t line 21.
FAILED at test 0
lib/Tie/File/t/28_mtwrite............Can't load '../lib/auto/POSIX/POSIX.so' for module POSIX: dynamic linker: ./perl: relocation error: symbol not
found: _mwoflocheckl
resolving symbol in ../lib/auto/POSIX/POSIX.so at ../lib/XSLoader.pm line 83.
 at ../lib/POSIX.pm line 26
Compilation failed in require at ../lib/Tie/File.pm line 5.
BEGIN failed--compilation aborted at ../lib/Tie/File.pm line 5.
Compilation failed in require at ../lib/Tie/File/t/28_mtwrite.t line 17.
BEGIN failed--compilation aborted at ../lib/Tie/File/t/28_mtwrite.t line 17.
FAILED at test 0
lib/Tie/File/t/29a_upcopy............Can't load '../lib/auto/POSIX/POSIX.so' for module POSIX: dynamic linker: ./perl: relocation error: symbol not
found: _mwoflocheckl
resolving symbol in ../lib/auto/POSIX/POSIX.so at ../lib/XSLoader.pm line 83.
 at ../lib/POSIX.pm line 26
Compilation failed in require at ../lib/Tie/File.pm line 5.
BEGIN failed--compilation aborted at ../lib/Tie/File.pm line 5.
Compilation failed in require at ../lib/Tie/File/t/29a_upcopy.t line 18.
BEGIN failed--compilation aborted at ../lib/Tie/File/t/29a_upcopy.t line 18.
FAILED at test 0
lib/Tie/File/t/29_downcopy...........Can't load '../lib/auto/POSIX/POSIX.so' for module POSIX: dynamic linker: ./perl: relocation error: symbol not
found: _mwoflocheckl
resolving symbol in ../lib/auto/POSIX/POSIX.so at ../lib/XSLoader.pm line 83.
 at ../lib/POSIX.pm line 26
Compilation failed in require at ../lib/Tie/File.pm line 5.
BEGIN failed--compilation aborted at ../lib/Tie/File.pm line 5.
Compilation failed in require at ../lib/Tie/File/t/29_downcopy.t line 18.

BEGIN failed--compilation aborted at ../lib/Tie/File/t/29_downcopy.t line 18.
FAILED at test 0
lib/Tie/File/t/30_defer..............Can't load '../lib/auto/POSIX/POSIX.so' for module POSIX: dynamic linker: ./perl: relocation error: symbol not
found: _mwoflocheckl
resolving symbol in ../lib/auto/POSIX/POSIX.so at ../lib/XSLoader.pm line 83.
 at ../lib/POSIX.pm line 26
Compilation failed in require at ../lib/Tie/File/t/30_defer.t line 10.
BEGIN failed--compilation aborted at ../lib/Tie/File/t/30_defer.t line 10.
FAILED at test 0
lib/Tie/File/t/31_autodefer..........Can't load '../lib/auto/POSIX/POSIX.so' for module POSIX: dynamic linker: ./perl: relocation error: symbol not
found: _mwoflocheckl
resolving symbol in ../lib/auto/POSIX/POSIX.so at ../lib/XSLoader.pm line 83.
 at ../lib/POSIX.pm line 26
Compilation failed in require at ../lib/Tie/File/t/31_autodefer.t line 9.
BEGIN failed--compilation aborted at ../lib/Tie/File/t/31_autodefer.t line 9.
FAILED at test 0
lib/Tie/File/t/32_defer_misc.........Can't load '../lib/auto/POSIX/POSIX.so' for module POSIX: dynamic linker: ./perl: relocation error: symbol not
found: _mwoflocheckl
resolving symbol in ../lib/auto/POSIX/POSIX.so at ../lib/XSLoader.pm line 83.
 at ../lib/POSIX.pm line 26
Compilation failed in require at ../lib/Tie/File/t/32_defer_misc.t line 8.
BEGIN failed--compilation aborted at ../lib/Tie/File/t/32_defer_misc.t line 8.
FAILED at test 0
lib/Tie/File/t/33_defer_vs...........Can't load '../lib/auto/POSIX/POSIX.so' for module POSIX: dynamic linker: ./perl: relocation error: symbol not
found: _mwoflocheckl
resolving symbol in ../lib/auto/POSIX/POSIX.so at ../lib/XSLoader.pm line 83.
 at ../lib/POSIX.pm line 26
Compilation failed in require at ../lib/Tie/File/t/33_defer_vs.t line 11.
BEGIN failed--compilation aborted at ../lib/Tie/File/t/33_defer_vs.t line 11.
FAILED at test 0
lib/Tie/File/t/40_abs_cache..........Can't load '../lib/auto/POSIX/POSIX.so' for module POSIX: dynamic linker: ./perl: relocation error: symbol not
found: _mwoflocheckl
resolving symbol in ../lib/auto/POSIX/POSIX.so at ../lib/XSLoader.pm line 83.
 at ../lib/POSIX.pm line 26
Compilation failed in require at ../lib/Tie/File.pm line 5.
BEGIN failed--compilation aborted at ../lib/Tie/File.pm line 5.
Compilation failed in require at ../lib/Tie/File/t/40_abs_cache.t line 28.
BEGIN failed--compilation aborted at ../lib/Tie/File/t/40_abs_cache.t line 28.
FAILED at test 0
lib/Tie/File/t/41_heap...............Can't load '../lib/auto/POSIX/POSIX.so' for module POSIX: dynamic linker: ./perl: relocation error: symbol not
found: _mwoflocheckl
resolving symbol in ../lib/auto/POSIX/POSIX.so at ../lib/XSLoader.pm line 83.
 at ../lib/POSIX.pm line 26
Compilation failed in require at ../lib/Tie/File.pm line 5.
BEGIN failed--compilation aborted at ../lib/Tie/File.pm line 5.
Compilation failed in require at ../lib/Tie/File/t/41_heap.t line 29.
BEGIN failed--compilation aborted at ../lib/Tie/File/t/41_heap.t line 29.
FAILED at test 0
lib/Tie/File/t/42_offset.............Can't load '../lib/auto/POSIX/POSIX.so' for module POSIX: dynamic linker: ./perl: relocation error: symbol not
found: _mwoflocheckl
resolving symbol in ../lib/auto/POSIX/POSIX.so at ../lib/XSLoader.pm line 83.
 at ../lib/POSIX.pm line 26
Compilation failed in require at ../lib/Tie/File/t/42_offset.t line 9.
BEGIN failed--compilation aborted at ../lib/Tie/File/t/42_offset.t line 9.
# Looks like your test died before it could output anything.
FAILED at test 0
lib/Tie/Handle/stdhandle.............ok
lib/Tie/Memoize......................ok
lib/Tie/RefHash......................ok
lib/Tie/Scalar.......................ok
lib/Tie/SubstrHash...................ok
lib/Time/gmtime......................ok
lib/Time/Local.......................ok
lib/Time/localtime...................ok
lib/Unicode/Collate/t/index..........ok
lib/Unicode/Collate/t/test...........ok
lib/Unicode/UCD......................ok
lib/User/grent.......................ok
lib/User/pwent.......................ok
lib/utf8.............................ok
lib/vars.............................ok
lib/vmsish...........................ok
lib/warnings.........................ok
t/pod/emptycmd.......................ok
t/pod/find...........................ok
t/pod/for............................ok
t/pod/headings.......................ok
t/pod/include........................ok
t/pod/included.......................ok
t/pod/lref...........................ok
t/pod/multiline_items................ok
t/pod/nested_items...................ok
t/pod/nested_seqs....................ok
t/pod/oneline_cmds...................ok
t/pod/plainer........................ok
t/pod/pod2usage......................ok
t/pod/poderrs........................ok
t/pod/podselect......................ok
t/pod/special_seqs...................ok
t/x2p/s2p............................ok
Failed 62 test scripts out of 700, 91.14% okay.
### Since not all tests were successful, you may want to run some of
### them individually and examine any diagnostic messages they produce.
### See the INSTALL document's section on "make test".
### You have a good chance to get more information by running
###   ./perl harness
### in the 't' directory since most (>=80%) of the tests succeeded.
### You may have to set your dynamic library search path,
### LD_LIBRARY_PATH, to point to the build directory:
###   setenv LD_LIBRARY_PATH `pwd`:$LD_LIBRARY_PATH; cd t; ./perl harness
###   LD_LIBRARY_PATH=`pwd`:$LD_LIBRARY_PATH; export LD_LIBRARY_PATH; cd t; ./perl harness
###   export LD_LIBRARY_PATH=`pwd`:$LD_LIBRARY_PATH; cd t; ./perl harness
### for csh-style shells, like tcsh; or for traditional/modern
### Bourne-style shells, like bash, ksh, and zsh, respectively.
u=0.97  s=1.46  cu=144.53  cs=38.18  scripts=700  tests=70709
*** Error code 1 (bu21)

make: fatal error.
*** Error code 1 (bu21)

make: fatal error.
*** Error code 1 (bu21)

make: fatal error.


[Please do not change anything below this line]
-----------------------------------------------------------------
---
Flags:
    category=install
    severity=medium
---
This perlbug was built using Perl v5.8.1 - Thu Sep 11 15:10:19 EDT 2003
It is being executed now by  Perl v5.6.1 - Thu May  8 10:32:36 EDT 2003.

Site configuration information for perl v5.6.1:

Configured by sthill at Thu May  8 10:32:36 EDT 2003.

Summary of my perl5 (revision 5.0 version 6 subversion 1) configuration:
  Platform:
    osname=svr4.2, osvers=1.1.2, archname=SHG2-svr4.2
    uname='s17a105 s17a105 4.2 1.1.2 shg2 386at '
    config_args='-de'
    hint=recommended, useposix=true, d_sigaction=define
    usethreads=undef use5005threads=undef useithreads=undef usemultiplicity=undef
    useperlio=undef d_sfio=undef uselargefiles=define usesocks=undef
    use64bitint=undef use64bitall=undef uselongdouble=undef
  Compiler:
    cc='/bin/cc', ccflags ='-I/usr/include -I/usr/ucbinclude',
    optimize='-g',
    cppflags='-I/usr/include -I/usr/ucbinclude'
    ccversion='', gccversion='', gccosandvers=''
    intsize=4, longsize=4, ptrsize=4, doublesize=8, byteorder=1234
    d_longlong=define, longlongsize=8, d_longdbl=define, longdblsize=12
    ivtype='long', ivsize=4, nvtype='double', nvsize=8, Off_t='off_t', lseeksize=4
    alignbytes=4, usemymalloc=y, prototype=define
  Linker and Libraries:
    ld='/bin/cc', ldflags ='-L/usr/ccs/lib -L/usr/ucblib -L/usr/gnu/lib'
    libpth=/usr/gnu/lib /lib /usr/lib /usr/ccs/lib /usr/ucblib
    libs=-lsocket -lnsl -ldbm -ldl -lld -lm -lc -lcrypt -lucb -lx
    perllibs=-lsocket -lnsl -ldl -lld -lm -lc -lcrypt -lucb -lx
    libc=, so=so, useshrplib=true, libperl=libperl.so
  Dynamic Linking:
    dlsrc=dl_dlopen.xs, dlext=so, d_dlsymun=undef, ccdlflags=' '
    cccdlflags='-KPIC', lddlflags='-G -L/usr/ccs/lib -L/usr/ucblib -L/usr/gnu/lib'

Locally applied patches:
    RC4

---
@INC for perl v5.6.1:
    /usr/local/lib/perl5/5.6.1/SHG2-svr4.2
    /usr/local/lib/perl5/5.6.1
    /usr/local/lib/perl5/site_perl/5.6.1/SHG2-svr4.2
    /usr/local/lib/perl5/site_perl/5.6.1
    /usr/local/lib/perl5/site_perl
    .

---
Environment for perl v5.6.1:
    HOME=/home/grommel
    LANG (unset)
    LANGUAGE (unset)
    LD_LIBRARY_PATH=/usr/gnu/lib/perl5
    LOGDIR (unset)
    PATH
=.:.:/aoi/RdwTest/appl/bin:/aoi/RdwTest/ops/bin:/aoi/RdwTest/sched/bin:/usr/xpt/bin:/opt/plc/bin:/usr/bin:/usr/sbin:/usr/bin/X11:/usr/lib:/etc:/usr/etc:/opt/topendadm/isd:/opt/topendadm/bin:/opt/topendadm/bin/admin:/opt/topenddir/bin:/opt/topenddir/bin/admin:/opt/topenddir/etc/tools:/usr/informix:/usr/informix/bin:/aoi/RdwProd/appl/bin:/aoi/RdwProd/sched/bin:/usr/local/bin:/usr/local/ibin:/usr/ntos/bin:/home/grommel/bin:/usr/gnu/bin:/usr/X/bin:.:/bin:/usr/ucb:/usr/local:/usr/lbin:/opt/bin:/usr/ccs/bin:/usr/ucblib:/lib:/usr/ccs/lib:/sbin

    PERL_BADLANG (unset)
    SHELL=/usr/bin/ksh






nntp.perl.org: Perl Programming lists via nntp and http.
Comments to Ask Bjørn Hansen at ask@perl.org | Group listing | About