develooper Front page | perl.perl5.porters | Postings from September 2003

Smoke [5.8.1] 21148 FAIL(Fc) linux 2.4.20-4gb (i686/1 cpu)

Thread Next
From:
h.m.brand
Date:
September 11, 2003 01:00
Subject:
Smoke [5.8.1] 21148 FAIL(Fc) linux 2.4.20-4gb (i686/1 cpu)
Message ID:
200309110800.h8B80WrH086073@smtpzilla1.xs4all.nl
Automated smoke report for 5.8.1 patch 21148 on linux - 2.4.20-4gb (i686/1 cpu)
(lt02) using  version 
Report by Test::Smoke v1.18.05 (perl 5.9.0) [19 hours 54 minutes]

O = OK  F = Failure(s), extended report at the bottom
X = test(s) failed under TEST but not under harness
? = still running or test results not (yet) available
Build failures during:       - = unknown or N/A
c = Configure, m = make, M = make (after miniperl), t = make test-prep

   21148     Configuration (common) none
------------ ----------------------------------------------------------------
O O F O O F
c c c c c c  -Duse64bitall
O O F O O F  -Duseithreads
c c c c c c  -Duseithreads -Duse64bitall
O O F O O F  -Accflags='-DPERL_COPY_ON_WRITE'
c c c c c c  -Accflags='-DPERL_COPY_ON_WRITE' -Duse64bitall
O O F O O F  -Accflags='-DPERL_COPY_ON_WRITE' -Duseithreads
c c c c c c  -Accflags='-DPERL_COPY_ON_WRITE' -Duseithreads -Duse64bitall
O O F O O F  -Dcc=gcc
c c c c c c  -Dcc=gcc -Duse64bitall
O O F O O F  -Dcc=gcc -Duseithreads
c c c c c c  -Dcc=gcc -Duseithreads -Duse64bitall
O O F O O F  -Dcc=gcc -Accflags='-DPERL_COPY_ON_WRITE'
c c c c c c  -Dcc=gcc -Accflags='-DPERL_COPY_ON_WRITE' -Duse64bitall
O O F O O F  -Dcc=gcc -Accflags='-DPERL_COPY_ON_WRITE' -Duseithreads
c c c c c c  -Dcc=gcc -Accflags='-DPERL_COPY_ON_WRITE' -Duseithreads
                (cont) -Duse64bitall
| | | | | +- LC_ALL = univ.utf8 -DDEBUGGING
| | | | +--- PERLIO = perlio -DDEBUGGING
| | | +----- PERLIO = stdio  -DDEBUGGING
| | +------- LC_ALL = univ.utf8
| +--------- PERLIO = perlio
+----------- PERLIO = stdio

Summary: FAIL(Fc)


Failures:

linux       [locale:univ.]
linux       [locale:univ.]-DDEBUGGING
    ../ext/B/t/debug.t......................FAILED 3
    ../ext/B/t/deparse.t....................FAILED 32
    ../ext/B/t/lint.t.......................FAILED 1-15
    ../ext/B/t/o.t..........................FAILED 2-5 7-9
    ../ext/Devel/DProf/t/DProf.t............FAILED 1-10 12-20
    ../ext/Filter/t/call.t..................FAILED 2 4 6 8 10 12
                                         14 16 18 20 22
                                         24 26 28
    ../lib/ExtUtils/t/prereq_print.t........FAILED 1 3-5 7-8
    ../lib/IPC/Open3.t......................FAILED 4 9-13 15
    ../lib/Tie/Array/std.t..................FAILED 73
    ../lib/charnames.t......................FAILED 47-73
    ../lib/h2xs.t...........................FAILED 3-4 23 42 61 80
    ../lib/strict.t.........................FAILED 1-99
    ../lib/subs.t...........................FAILED 1-9
    ../lib/utf8.t...........................FAILED 16-30
    ../lib/warnings.t.......................FAILED 214 225 276 280
    ../t/io/argv.t..........................FAILED 22
    ../t/op/anonsub.t.......................FAILED 1-5
    ../t/op/array.t.........................FAILED 73
    ../t/op/eval.t..........................FAILED 85
    ../t/op/fork.t..........................FAILED 1-18
    ../t/op/method.t........................FAILED 76-78
    ../t/op/recurse.t.......................FAILED 27
    ../t/op/ref.t...........................FAILED 56-57
    ../t/op/runlevel.t......................FAILED 1-24
    ../t/op/stash.t.........................FAILED 1-2
    ../t/op/tie.t...........................FAILED 1-17 19-29
    ../t/run/fresh_perl.t...................FAILED 1-93
    ../t/run/runenv.t.......................FAILED 1-17
    ../t/run/switchC.t......................FAILED 1 3-6
    ../t/run/switchI.t......................FAILED 3-4

linux       [locale:univ.]-Duseithreads
linux       [locale:univ.]-DDEBUGGING -Duseithreads
    ../ext/B/t/debug.t......................FAILED 3
    ../ext/B/t/deparse.t....................FAILED 32
    ../ext/B/t/lint.t.......................FAILED 1-4
    ../ext/B/t/o.t..........................FAILED 2-5 7-9
    ../ext/Devel/DProf/t/DProf.t............FAILED 1-10 12-20
    ../ext/Filter/t/call.t..................FAILED 2 4 6 8 10 12
                                         14 16 18 20 22
                                         24 26 28
    ../lib/ExtUtils/t/prereq_print.t........FAILED 1 3-5 7-8
    ../lib/IPC/Open3.t......................FAILED 4 9-13 15
    ../lib/Tie/Array/std.t..................FAILED 73
    ../lib/charnames.t......................FAILED 47-73
    ../lib/h2xs.t...........................FAILED 3-4 23 42 61 80
    ../lib/strict.t.........................FAILED 1-99
    ../lib/subs.t...........................FAILED 1-9
    ../lib/utf8.t...........................FAILED 16-30
    ../lib/warnings.t.......................FAILED 214 225 276 280
    ../t/io/argv.t..........................FAILED 22
    ../t/op/anonsub.t.......................FAILED 1-5
    ../t/op/array.t.........................FAILED 73
    ../t/op/eval.t..........................FAILED 85
    ../t/op/fork.t..........................FAILED 1-18
    ../t/op/method.t........................FAILED 76-78
    ../t/op/recurse.t.......................FAILED 27
    ../t/op/ref.t...........................FAILED 56-57
    ../t/op/runlevel.t......................FAILED 1-24
    ../t/op/stash.t.........................FAILED 1-2
    ../t/op/tie.t...........................FAILED 1-17 19-29
    ../t/run/fresh_perl.t...................FAILED 1-93
    ../t/run/runenv.t.......................FAILED 1-17
    ../t/run/switchC.t......................FAILED 1 3-6
    ../t/run/switchI.t......................FAILED 3-4

linux       [locale:univ.]-Accflags='-DPERL_COPY_ON_WRITE'
linux       [locale:univ.]-DDEBUGGING -Accflags='-DPERL_COPY_ON_WRITE'
    ../ext/B/t/debug.t......................FAILED 3
    ../ext/B/t/deparse.t....................FAILED 32
    ../ext/B/t/lint.t.......................FAILED 1-15
    ../ext/B/t/o.t..........................FAILED 2-5 7-9
    ../ext/Devel/DProf/t/DProf.t............FAILED 1-10 12-20
    ../ext/Filter/t/call.t..................FAILED 2 4 6 8 10 12
                                         14 16 18 20 22
                                         24 26 28
    ../lib/ExtUtils/t/prereq_print.t........FAILED 1 3-5 7-8
    ../lib/IPC/Open3.t......................FAILED 4 9-13 15
    ../lib/Tie/Array/std.t..................FAILED 73
    ../lib/charnames.t......................FAILED 47-73
    ../lib/h2xs.t...........................FAILED 3-4 23 42 61 80
    ../lib/strict.t.........................FAILED 1-99
    ../lib/subs.t...........................FAILED 1-9
    ../lib/utf8.t...........................FAILED 16-30
    ../lib/warnings.t.......................FAILED 214 225 276 280
    ../t/io/argv.t..........................FAILED 22
    ../t/op/anonsub.t.......................FAILED 1-5
    ../t/op/array.t.........................FAILED 73
    ../t/op/eval.t..........................FAILED 85
    ../t/op/fork.t..........................FAILED 1-18
    ../t/op/method.t........................FAILED 76-78
    ../t/op/recurse.t.......................FAILED 27
    ../t/op/ref.t...........................FAILED 56-57
    ../t/op/runlevel.t......................FAILED 1-24
    ../t/op/stash.t.........................FAILED 1-2
    ../t/op/tie.t...........................FAILED 1-17 19-29
    ../t/run/fresh_perl.t...................FAILED 1-93
    ../t/run/runenv.t.......................FAILED 1-17
    ../t/run/switchC.t......................FAILED 1 3-6
    ../t/run/switchI.t......................FAILED 3-4

linux       [locale:univ.]-Accflags='-DPERL_COPY_ON_WRITE'
              (cont) -Duseithreads
linux       [locale:univ.]-DDEBUGGING -Accflags='-DPERL_COPY_ON_WRITE'
              (cont) -Duseithreads
    ../ext/B/t/debug.t......................FAILED 3
    ../ext/B/t/deparse.t....................FAILED 32
    ../ext/B/t/lint.t.......................FAILED 1-4
    ../ext/B/t/o.t..........................FAILED 2-5 7-9
    ../ext/Devel/DProf/t/DProf.t............FAILED 1-10 12-20
    ../ext/Filter/t/call.t..................FAILED 2 4 6 8 10 12
                                         14 16 18 20 22
                                         24 26 28
    ../lib/ExtUtils/t/prereq_print.t........FAILED 1 3-5 7-8
    ../lib/IPC/Open3.t......................FAILED 4 9-13 15
    ../lib/Tie/Array/std.t..................FAILED 73
    ../lib/charnames.t......................FAILED 47-73
    ../lib/h2xs.t...........................FAILED 3-4 23 42 61 80
    ../lib/strict.t.........................FAILED 1-99
    ../lib/subs.t...........................FAILED 1-9
    ../lib/utf8.t...........................FAILED 16-30
    ../lib/warnings.t.......................FAILED 214 225 276 280
    ../t/io/argv.t..........................FAILED 22
    ../t/op/anonsub.t.......................FAILED 1-5
    ../t/op/array.t.........................FAILED 73
    ../t/op/eval.t..........................FAILED 85
    ../t/op/fork.t..........................FAILED 1-18
    ../t/op/method.t........................FAILED 76-78
    ../t/op/recurse.t.......................FAILED 27
    ../t/op/ref.t...........................FAILED 56-57
    ../t/op/runlevel.t......................FAILED 1-24
    ../t/op/stash.t.........................FAILED 1-2
    ../t/op/tie.t...........................FAILED 1-17 19-29
    ../t/run/fresh_perl.t...................FAILED 1-93
    ../t/run/runenv.t.......................FAILED 1-17
    ../t/run/switchC.t......................FAILED 1 3-6
    ../t/run/switchI.t......................FAILED 3-4

linux       [locale:univ.]-Dcc=gcc
linux       [locale:univ.]-DDEBUGGING -Dcc=gcc
    ../ext/B/t/debug.t......................FAILED 3
    ../ext/B/t/deparse.t....................FAILED 32
    ../ext/B/t/lint.t.......................FAILED 1-15
    ../ext/B/t/o.t..........................FAILED 2-5 7-9
    ../ext/Devel/DProf/t/DProf.t............FAILED 1-10 12-20
    ../ext/Filter/t/call.t..................FAILED 2 4 6 8 10 12
                                         14 16 18 20 22
                                         24 26 28
    ../lib/ExtUtils/t/prereq_print.t........FAILED 1 3-5 7-8
    ../lib/IPC/Open3.t......................FAILED 4 9-13 15
    ../lib/Tie/Array/std.t..................FAILED 73
    ../lib/charnames.t......................FAILED 47-73
    ../lib/h2xs.t...........................FAILED 3-4 23 42 61 80
    ../lib/strict.t.........................FAILED 1-99
    ../lib/subs.t...........................FAILED 1-9
    ../lib/utf8.t...........................FAILED 16-30
    ../lib/warnings.t.......................FAILED 214 225 276 280
    ../t/io/argv.t..........................FAILED 22
    ../t/op/anonsub.t.......................FAILED 1-5
    ../t/op/array.t.........................FAILED 73
    ../t/op/eval.t..........................FAILED 85
    ../t/op/fork.t..........................FAILED 1-18
    ../t/op/method.t........................FAILED 76-78
    ../t/op/recurse.t.......................FAILED 27
    ../t/op/ref.t...........................FAILED 56-57
    ../t/op/runlevel.t......................FAILED 1-24
    ../t/op/stash.t.........................FAILED 1-2
    ../t/op/tie.t...........................FAILED 1-17 19-29
    ../t/run/fresh_perl.t...................FAILED 1-93
    ../t/run/runenv.t.......................FAILED 1-17
    ../t/run/switchC.t......................FAILED 1 3-6
    ../t/run/switchI.t......................FAILED 3-4

linux       [locale:univ.]-Dcc=gcc -Duseithreads
linux       [locale:univ.]-DDEBUGGING -Dcc=gcc -Duseithreads
    ../ext/B/t/debug.t......................FAILED 3
    ../ext/B/t/deparse.t....................FAILED 32
    ../ext/B/t/lint.t.......................FAILED 1-4
    ../ext/B/t/o.t..........................FAILED 2-5 7-9
    ../ext/Devel/DProf/t/DProf.t............FAILED 1-10 12-20
    ../ext/Filter/t/call.t..................FAILED 2 4 6 8 10 12
                                         14 16 18 20 22
                                         24 26 28
    ../lib/ExtUtils/t/prereq_print.t........FAILED 1 3-5 7-8
    ../lib/IPC/Open3.t......................FAILED 4 9-13 15
    ../lib/Tie/Array/std.t..................FAILED 73
    ../lib/charnames.t......................FAILED 47-73
    ../lib/h2xs.t...........................FAILED 3-4 23 42 61 80
    ../lib/strict.t.........................FAILED 1-99
    ../lib/subs.t...........................FAILED 1-9
    ../lib/utf8.t...........................FAILED 16-30
    ../lib/warnings.t.......................FAILED 214 225 276 280
    ../t/io/argv.t..........................FAILED 22
    ../t/op/anonsub.t.......................FAILED 1-5
    ../t/op/array.t.........................FAILED 73
    ../t/op/eval.t..........................FAILED 85
    ../t/op/fork.t..........................FAILED 1-18
    ../t/op/method.t........................FAILED 76-78
    ../t/op/recurse.t.......................FAILED 27
    ../t/op/ref.t...........................FAILED 56-57
    ../t/op/runlevel.t......................FAILED 1-24
    ../t/op/stash.t.........................FAILED 1-2
    ../t/op/tie.t...........................FAILED 1-17 19-29
    ../t/run/fresh_perl.t...................FAILED 1-93
    ../t/run/runenv.t.......................FAILED 1-17
    ../t/run/switchC.t......................FAILED 1 3-6
    ../t/run/switchI.t......................FAILED 3-4

linux       [locale:univ.]-Dcc=gcc -Accflags='-DPERL_COPY_ON_WRITE'
linux       [locale:univ.]-DDEBUGGING -Dcc=gcc
              (cont) -Accflags='-DPERL_COPY_ON_WRITE'
    ../ext/B/t/debug.t......................FAILED 3
    ../ext/B/t/deparse.t....................FAILED 32
    ../ext/B/t/lint.t.......................FAILED 1-15
    ../ext/B/t/o.t..........................FAILED 2-5 7-9
    ../ext/Devel/DProf/t/DProf.t............FAILED 1-10 12-20
    ../ext/Filter/t/call.t..................FAILED 2 4 6 8 10 12
                                         14 16 18 20 22
                                         24 26 28
    ../lib/ExtUtils/t/prereq_print.t........FAILED 1 3-5 7-8
    ../lib/IPC/Open3.t......................FAILED 4 9-13 15
    ../lib/Tie/Array/std.t..................FAILED 73
    ../lib/charnames.t......................FAILED 47-73
    ../lib/h2xs.t...........................FAILED 3-4 23 42 61 80
    ../lib/strict.t.........................FAILED 1-99
    ../lib/subs.t...........................FAILED 1-9
    ../lib/utf8.t...........................FAILED 16-30
    ../lib/warnings.t.......................FAILED 214 225 276 280
    ../t/io/argv.t..........................FAILED 22
    ../t/op/anonsub.t.......................FAILED 1-5
    ../t/op/array.t.........................FAILED 73
    ../t/op/eval.t..........................FAILED 85
    ../t/op/fork.t..........................FAILED 1-18
    ../t/op/method.t........................FAILED 76-78
    ../t/op/recurse.t.......................FAILED 27
    ../t/op/ref.t...........................FAILED 56-57
    ../t/op/runlevel.t......................FAILED 1-24
    ../t/op/stash.t.........................FAILED 1-2
    ../t/op/tie.t...........................FAILED 1-17 19-29
    ../t/run/fresh_perl.t...................FAILED 1-93
    ../t/run/runenv.t.......................FAILED 1-17
    ../t/run/switchC.t......................FAILED 1 3-6
    ../t/run/switchI.t......................FAILED 3-4

linux       [locale:univ.]-Dcc=gcc -Accflags='-DPERL_COPY_ON_WRITE'
              (cont) -Duseithreads
    ../ext/B/t/debug.t......................FAILED 3
    ../ext/B/t/deparse.t....................FAILED 32
    ../ext/B/t/lint.t.......................FAILED 1-4
    ../ext/B/t/o.t..........................FAILED 2-5 7-9
    ../ext/Devel/DProf/t/DProf.t............FAILED 1-10 12-20
    ../ext/Filter/t/call.t..................FAILED 2 4 6 8 10 12
                                         14 16 18 20 22
                                         24 26 28
    ../lib/ExtUtils/t/prereq_print.t........FAILED 1 3-5 7-8
    ../lib/IPC/Open3.t......................FAILED 4 10-13 15
    ../lib/Tie/Array/std.t..................FAILED 73
    ../lib/charnames.t......................FAILED 47-73
    ../lib/h2xs.t...........................FAILED 3-4 23 42 61 80
    ../lib/strict.t.........................FAILED 1-99
    ../lib/subs.t...........................FAILED 1-9
    ../lib/utf8.t...........................FAILED 16-30
    ../lib/warnings.t.......................FAILED 214 225 276 280
    ../t/io/argv.t..........................FAILED 22
    ../t/op/anonsub.t.......................FAILED 1-5
    ../t/op/array.t.........................FAILED 73
    ../t/op/eval.t..........................FAILED 85
    ../t/op/fork.t..........................FAILED 1-18
    ../t/op/method.t........................FAILED 76-78
    ../t/op/recurse.t.......................FAILED 27
    ../t/op/ref.t...........................FAILED 56-57
    ../t/op/runlevel.t......................FAILED 1-24
    ../t/op/stash.t.........................FAILED 1-2
    ../t/op/tie.t...........................FAILED 1-17 19-29
    ../t/run/fresh_perl.t...................FAILED 1-93
    ../t/run/runenv.t.......................FAILED 1-17
    ../t/run/switchC.t......................FAILED 1 3-6
    ../t/run/switchI.t......................FAILED 3-4

linux       [locale:univ.]-DDEBUGGING -Dcc=gcc
              (cont) -Accflags='-DPERL_COPY_ON_WRITE' -Duseithreads
    ../ext/B/t/debug.t......................FAILED 3
    ../ext/B/t/deparse.t....................FAILED 32
    ../ext/B/t/lint.t.......................FAILED 1-4
    ../ext/B/t/o.t..........................FAILED 2-5 7-9
    ../ext/Devel/DProf/t/DProf.t............FAILED 1-10 12-20
    ../ext/Filter/t/call.t..................FAILED 2 4 6 8 10 12
                                         14 16 18 20 22
                                         24 26 28
    ../lib/ExtUtils/t/prereq_print.t........FAILED 1 3-5 7-8
    ../lib/IPC/Open3.t......................FAILED 4 9-13 15
    ../lib/Tie/Array/std.t..................FAILED 73
    ../lib/charnames.t......................FAILED 47-73
    ../lib/h2xs.t...........................FAILED 3-4 23 42 61 80
    ../lib/strict.t.........................FAILED 1-99
    ../lib/subs.t...........................FAILED 1-9
    ../lib/utf8.t...........................FAILED 16-30
    ../lib/warnings.t.......................FAILED 214 225 276 280
    ../t/io/argv.t..........................FAILED 22
    ../t/op/anonsub.t.......................FAILED 1-5
    ../t/op/array.t.........................FAILED 73
    ../t/op/eval.t..........................FAILED 85
    ../t/op/fork.t..........................FAILED 1-18
    ../t/op/method.t........................FAILED 76-78
    ../t/op/recurse.t.......................FAILED 27
    ../t/op/ref.t...........................FAILED 56-57
    ../t/op/runlevel.t......................FAILED 1-24
    ../t/op/stash.t.........................FAILED 1-2
    ../t/op/tie.t...........................FAILED 1-17 19-29
    ../t/run/fresh_perl.t...................FAILED 1-93
    ../t/run/runenv.t.......................FAILED 1-17
    ../t/run/switchC.t......................FAILED 1 3-6
    ../t/run/switchI.t......................FAILED 3-4



MANIFEST did not declare 'mktest.log'
MANIFEST did not declare 'mktest2.rpt'


Thread Next


nntp.perl.org: Perl Programming lists via nntp and http.
Comments to Ask Bjørn Hansen at ask@perl.org | Group listing | About