develooper Front page | perl.perl5.porters | Postings from June 2003

Smoke [5.9.0] 19866 FAIL(F) linux 2.4.20-4gb (i686/1 cpu)

Thread Previous
From:
h.m.brand
Date:
June 30, 2003 00:39
Subject:
Smoke [5.9.0] 19866 FAIL(F) linux 2.4.20-4gb (i686/1 cpu)
Message ID:
20030628221721.0DDC623601@lt02.procura.nl
Automated smoke report for 5.9.0 patch 19866 on linux - 2.4.20-4gb (i686/1 cpu)
(lt02) using gcc version 3.3
Report generated by Test::Smoke v1.17.05 (perl 5.9.0)

O = OK  F = Failure(s), extended report at the bottom
? = still running or test results not (yet) available
Build failures during:       - = unknown or N/A
    c = Configure, m = make, t = make test-prep

   19866     Configuration (common) none
------------ ----------------------------------------------------------------
O O F O O F
O O F O O F  -Duse64bitint
O O F O O F  -Duselongdouble
O O F O O F  -Dusemorebits
O O F O O F  -Duseithreads
O O F O O F  -Duseithreads -Duse64bitint
O O F O O F  -Duseithreads -Duselongdouble
O O F O O F  -Duseithreads -Dusemorebits
| | | | | +- LC_ALL = en_US.utf8 -DDEBUGGING
| | | | +--- PERLIO = perlio -DDEBUGGING
| | | +----- PERLIO = stdio  -DDEBUGGING
| | +------- LC_ALL = en_US.utf8
| +--------- PERLIO = perlio
+----------- PERLIO = stdio

Summary: FAIL(F)


Failures:

linux       [locale:en_US]
linux       [locale:en_US]-DDEBUGGING
    t/comp/require.......................FAILED at test 28
../t/comp/require....FAILED test 27

linux       [locale:en_US]-Duse64bitint
    t/comp/require.......................FAILED at test 28
    ext/Encode/t/Aliases.................FAILED at test 11
../t/comp/require..........FAILED test 27

linux       [locale:en_US]-DDEBUGGING -Duse64bitint
    t/comp/require.......................FAILED at test 28
../t/comp/require....FAILED test 27

linux       [locale:en_US]-Duselongdouble
    t/comp/require.......................FAILED at test 28
    lib/Hash/Util........................FAILED at test 26
../t/comp/require....FAILED test 27

linux       [locale:en_US]-DDEBUGGING -Duselongdouble
    t/comp/require.......................FAILED at test 28
    ext/Encode/t/Aliases.................FAILED at test 3
../t/comp/require..........FAILED test 27

linux       [locale:en_US]-Dusemorebits
    t/comp/require.......................FAILED at test 28
    lib/Hash/Util........................FAILED at test 26
../t/comp/require....FAILED test 27
../lib/Hash/Util.....dubiousD. FAILED test 26

linux       [locale:en_US]-DDEBUGGING -Dusemorebits
    t/comp/require.......................FAILED at test 28
    ext/Encode/t/Aliases.................FAILED at test 18
../t/comp/require..........FAILED test 27

linux       [locale:en_US]-Duseithreads
    t/comp/require.......................FAILED at test 28
    ext/Encode/t/Aliases.................FAILED at test 24
    lib/Hash/Util........................FAILED at test 26
../t/comp/require..........FAILED test 27

linux       [locale:en_US]-DDEBUGGING -Duseithreads
linux       [locale:en_US]-Duseithreads -Duse64bitint
linux       [locale:en_US]-DDEBUGGING -Duseithreads -Duse64bitint
linux       [locale:en_US]-Duseithreads -Duselongdouble
linux       [locale:en_US]-DDEBUGGING -Duseithreads -Duselongdouble
linux       [locale:en_US]-Duseithreads -Dusemorebits
    t/comp/require.......................FAILED at test 28
../t/comp/require....FAILED test 27

linux       [locale:en_US]-DDEBUGGING -Duseithreads -Dusemorebits
    t/comp/require.......................FAILED at test 28
    ext/Encode/t/Aliases.................FAILED at test 48
    lib/Hash/Util........................FAILED at test 26
../t/comp/require..........FAILED test 27



MANIFEST did not declare Conf
MANIFEST did not declare Conf-gcc
MANIFEST did not declare Rsync
MANIFEST did not declare Xsync
MANIFEST did not declare mkovz.pl
MANIFEST did not declare mktest
MANIFEST did not declare mktest-gcc
MANIFEST did not declare mktest.rpt
MANIFEST did not declare mktest1
MANIFEST did not declare mktest2.rpt
MANIFEST did not declare rm.sh
MANIFEST did not declare rmf.sh
MANIFEST did not declare smoke.env
MANIFEST did not declare smoke.sh


Thread Previous


nntp.perl.org: Perl Programming lists via nntp and http.
Comments to Ask Bjørn Hansen at ask@perl.org | Group listing | About