develooper Front page | perl.perl5.porters | Postings from June 2003

Problem building PERL 5.8 on SCO Openserver 5.0.0

Thread Next
From:
Richard Thomas
Date:
June 28, 2003 12:03
Subject:
Problem building PERL 5.8 on SCO Openserver 5.0.0
Message ID:
Law14-F28TNyd89kUyV00023ca7@hotmail.com
Hi,

I am trying to build PERL 5.8 on SCO Openserver 5.0.0

This seems to go wrong at the stage that I do a "make test"

The following is the output from where is starts to go wrong "Can't load 
'../lib/auto/File/Glob/Glob.so'" (77 lines down)

Please could anybody who knows what might be going wrong here let me know.

Thanks, Richard Thomas

	Making threads::shared (dynamic)
make[1]: Entering directory `/usr3/richardt/perl-5.8.0/ext/threads/shared'
make[1]: Leaving directory `/usr3/richardt/perl-5.8.0/ext/threads/shared'
make[1]: Entering directory `/usr3/richardt/perl-5.8.0/ext/threads/shared'
make[1]: Leaving directory `/usr3/richardt/perl-5.8.0/ext/threads/shared'
PERL=./perl make _test_prep
make[1]: Entering directory `/usr3/richardt/perl-5.8.0'
cd t && (rm -f ./perl; /bin/ln -s .././perl ./perl)
make[1]: Leaving directory `/usr3/richardt/perl-5.8.0'
PERL=./perl make _test
make[1]: Entering directory `/usr3/richardt/perl-5.8.0'
if (true </dev/tty) >/dev/null 2>&1; then \
  make TEST_ARGS= TESTFILE=TEST _test_tty   ; \
else \
  make TEST_ARGS= TESTFILE=TEST _test_notty ; \
fi
make[2]: Entering directory `/usr3/richardt/perl-5.8.0'
cd t &&   PERL_SKIP_TTY_TEST=1 ./perl TEST
t/base/cond..........................ok
t/base/if............................ok
t/base/lex...........................ok
t/base/num...........................ok
t/base/pat...........................ok
t/base/rs............................ok
t/base/term..........................ok
t/comp/bproto........................ok
t/comp/cmdopt........................ok
t/comp/colon.........................ok
t/comp/cpp...........................ok
t/comp/decl..........................ok
t/comp/hints.........................ok
t/comp/multiline.....................ok
t/comp/package.......................ok
t/comp/proto.........................ok
t/comp/redef.........................ok
t/comp/require.......................ok
t/comp/script........................ok
t/comp/term..........................ok
t/comp/use...........................ok
t/cmd/elsif..........................ok
t/cmd/for............................ok
t/cmd/mod............................ok
t/cmd/subval.........................ok
t/cmd/switch.........................ok
t/cmd/while..........................ok
t/run/exit...........................ok
t/run/fresh_perl.....................# PROG:
# package Foo;
# eval { require AnyDBM_File }; # not all places have dbm* functions
# if ($@) {
#     print "ok\n";
#     exit 0;
# }
# package Foo;
# sub new {
#         my $proto = shift;
#         my $class = ref($proto) || $proto;
#         my $self  = {};
#         bless($self,$class);
#         my %LT;
#         dbmopen(%LT, "dbmtest", 0666) ||
# 	    die "Can't open dbmtest because of $!\n";
#         $self->{'LT'} = \%LT;
#         return $self;
# }
# sub DESTROY {
#         my $self = shift;
# 	dbmclose(%{$self->{'LT'}});
# 	1 while unlink 'dbmtest';
# 	1 while unlink <dbmtest.*>;
# 	print "ok\n";
# }
# package main;
# $test = Foo->new(); # must be package var
# EXPECTED:
# ok
# GOT:
# Can't load '../lib/auto/File/Glob/Glob.so' for module File::Glob: dynamic 
linker: ./perl: relocation error: symbol not found: PL_stack_sp at 
../lib/XSLoader.pm line 83.
#  at ../lib/File/Glob.pm line 96
# Compilation failed in require at - line 23.
# BEGIN failed--compilation aborted at - line 23.
# STATUS: 65280
# Failed at ./test.pl line 567
FAILED at test 91
t/run/noswitch.......................ok
t/run/runenv.........................ok
t/run/switchF........................ok
t/run/switchPx.......................ok
t/run/switcha........................ok
t/run/switches.......................ok
t/run/switchn........................ok
t/run/switchp........................ok
t/run/switcht........................ok
t/run/switchx........................ok
t/io/argv............................ok
t/io/binmode.........................ok
t/io/crlf............................ok
t/io/dup.............................ok
t/io/fflush..........................ok
t/io/fs..............................ok
t/io/inplace.........................ok
t/io/iprefix.........................ok
t/io/nargv...........................ok
t/io/open............................ok
t/io/openpid.........................ok
t/io/pipe............................ok
t/io/print...........................ok
t/io/read............................ok
t/io/tell............................ok
t/io/utf8............................ok
t/op/64bitint........................skipping test on this platform
t/op/alarm...........................ok
t/op/anonsub.........................ok
t/op/append..........................ok
t/op/args............................ok
t/op/arith...........................ok
t/op/array...........................ok
t/op/assignwarn......................ok
t/op/attrs...........................ok
t/op/auto............................ok
t/op/avhv............................ok
t/op/bless...........................ok
t/op/bop.............................ok
t/op/caller..........................ok
t/op/chars...........................ok
t/op/chdir...........................ok
t/op/chop............................ok
t/op/closure.........................ok
t/op/cmp.............................ok
t/op/concat..........................ok
t/op/cond............................ok
t/op/context.........................ok
t/op/crypt...........................ok
t/op/defins..........................Can't load 
'../lib/auto/File/Glob/Glob.so' for module File::Glob: dynamic linker: 
./perl: relocation error: symbol not found: PL_stack_sp at 
../lib/XSLoader.pm line 83.
at ../lib/File/Glob.pm line 96
Compilation failed in require at op/defins.t line 96.
BEGIN failed--compilation aborted at op/defins.t line 96.
FAILED at test 1
t/op/delete..........................ok
t/op/die.............................ok
t/op/die_exit........................ok
t/op/do..............................ok
t/op/each............................ok
t/op/eval............................ok
t/op/exec............................ok
t/op/exists_sub......................ok
t/op/exp.............................ok
t/op/fh..............................ok
t/op/filetest........................ok
t/op/flip............................ok
t/op/fork............................ok
t/op/glob............................Can't load 
'../lib/auto/File/Glob/Glob.so' for module File::Glob: dynamic linker: 
./perl: relocation error: symbol not found: PL_stack_sp at 
../lib/XSLoader.pm line 83.
at ../lib/File/Glob.pm line 96
Compilation failed in require at op/glob.t line 10.
BEGIN failed--compilation aborted at op/glob.t line 10.
FAILED at test 0
t/op/gmagic..........................ok
t/op/goto............................ok
t/op/goto_xs.........................skipping test on this platform
t/op/grent...........................ok
t/op/grep............................ok
t/op/groups..........................ok
t/op/gv..............................ok
t/op/hashassign......................ok
t/op/hashwarn........................ok
t/op/inc.............................ok
t/op/inccode.........................ok
t/op/index...........................ok
t/op/int.............................ok
t/op/join............................ok
t/op/lc..............................ok
t/op/length..........................ok
t/op/lex_assign......................Can't load 
'../lib/auto/File/Glob/Glob.so' for module File::Glob: dynamic linker: 
./perl: relocation error: symbol not found: PL_stack_sp at 
../lib/XSLoader.pm line 83, <DATA> line 153.
at ../lib/File/Glob.pm line 96
Compilation failed in require at (eval 5) line 4, <DATA> line 153.
BEGIN failed--compilation aborted at (eval 5) line 4, <DATA> line 153.
FAILED at test 15
t/op/lfs.............................skipping test on this platform
t/op/list............................ok
t/op/local...........................ok
t/op/loopctl.........................ok
t/op/lop.............................ok
t/op/magic...........................ok
t/op/method..........................ok
t/op/mkdir...........................ok
t/op/my..............................ok
t/op/my_stash........................ok
t/op/nothr5005.......................ok
t/op/numconvert......................ok
t/op/oct.............................ok
t/op/or..............................ok
t/op/ord.............................ok
t/op/override........................ok
t/op/pack............................ok
t/op/pat.............................ok
t/op/pos.............................ok
t/op/pow.............................ok
t/op/push............................ok
t/op/pwent...........................ok
t/op/qq..............................ok
t/op/quotemeta.......................ok
t/op/rand............................ok
t/op/range...........................ok
t/op/read............................ok
t/op/readdir.........................Can't load 
'../lib/auto/File/Glob/Glob.so' for module File::Glob: dynamic linker: 
./perl: relocation error: symbol not found: PL_stack_sp at 
../lib/XSLoader.pm line 83.
at ../lib/File/Glob.pm line 96
Compilation failed in require at op/readdir.t line 35.
BEGIN failed--compilation aborted at op/readdir.t line 35.
FAILED at test 0
t/op/recurse.........................ok
t/op/ref.............................ok
t/op/regexp..........................ok
t/op/regexp_noamp....................ok
t/op/regmesg.........................ok
t/op/repeat..........................ok
t/op/reverse.........................ok
t/op/runlevel........................ok
t/op/sleep...........................ok
t/op/sort............................ok
t/op/splice..........................ok
t/op/split...........................ok
t/op/sprintf.........................ok
t/op/srand...........................ok
t/op/stat............................ok
t/op/study...........................ok
t/op/sub_lval........................ok
t/op/subst...........................ok
t/op/subst_amp.......................ok
t/op/subst_wamp......................ok
t/op/substr..........................ok
t/op/sysio...........................ok
t/op/taint...........................Can't load 
'../lib/auto/File/Glob/Glob.so' for module File::Glob: dynamic linker: 
./perl: relocation error: symbol not found: PL_stack_sp at 
../lib/XSLoader.pm line 83.
at ../lib/File/Glob.pm line 96
Compilation failed in require at op/taint.t line 297.
BEGIN failed--compilation aborted at op/taint.t line 297.
FAILED at test 0
t/op/tie.............................ok
t/op/tiearray........................ok
t/op/tiehandle.......................ok
t/op/time............................ok
t/op/tr..............................ok
t/op/undef...........................ok
t/op/universal.......................ok
t/op/unshift.........................ok
t/op/utf8decode......................ok
t/op/utfhash.........................ok
t/op/vec.............................ok
t/op/ver.............................ok
t/op/wantarray.......................ok
t/op/write...........................ok
t/uni/fold...........................ok
t/uni/lower..........................ok
t/uni/sprintf........................ok
t/uni/title..........................ok
t/uni/upper..........................ok
t/lib/1_compile......................# require failed with 'Can't load 
'../lib/auto/B/B.so' for module B: dynamic linker: ./perl: relocation error: 
symbol not found: PL_opargs at ../lib/XSLoader.pm line 83.
#  at ../lib/B.pm line 301
# Compilation failed in require at ../lib/B/C.pm line 12.
# BEGIN failed--compilation aborted at ../lib/B/C.pm line 12.
# Compilation failed in require at (eval 1) line 1.
# BEGIN failed--compilation aborted at (eval 1) line 1.
# '
# require failed with 'Can't load '../lib/auto/B/B.so' for module B: dynamic 
linker: ./perl: relocation error: symbol not found: PL_opargs at 
../lib/XSLoader.pm line 83.
#  at ../lib/B.pm line 301
# Compilation failed in require at ../lib/B/CC.pm line 20.
# BEGIN failed--compilation aborted at ../lib/B/CC.pm line 20.
# Compilation failed in require at (eval 1) line 1.
# BEGIN failed--compilation aborted at (eval 1) line 1.
# '
FAILED at test 2
t/lib/commonsense....................ok
ext/attrs............................skipping test on this platform
ext/B/t/asmdata......................ok
ext/B/t/assembler....................Can't load '../lib/auto/B/B.so' for 
module B: dynamic linker: ./perl: relocation error: symbol not found: 
PL_opargs at ../lib/XSLoader.pm line 83.
at ../lib/B.pm line 301
Compilation failed in require at ../lib/B/Assembler.pm line 10.
BEGIN failed--compilation aborted at ../lib/B/Assembler.pm line 10.
Compilation failed in require at ../ext/B/t/assembler.t line 165.
BEGIN failed--compilation aborted at ../ext/B/t/assembler.t line 165.
FAILED at test 0
ext/B/t/b............................Can't load '../lib/auto/B/B.so' for 
module B: dynamic linker: ./perl: relocation error: symbol not found: 
PL_opargs at ../lib/XSLoader.pm line 83.
at ../lib/B.pm line 301
Compilation failed in require at ../ext/B/t/b.t line 24.
BEGIN failed--compilation aborted at ../ext/B/t/b.t line 24.
FAILED at test 0
ext/B/t/bblock.......................#     Failed test (../ext/B/t/bblock.t 
at line 10)
#     Tried to use 'B::Bblock'.
#     Error:  Can't load '../lib/auto/B/B.so' for module B: dynamic linker: 
./perl: relocation error: symbol not found: PL_opargs at ../lib/XSLoader.pm 
line 83.
#  at ../lib/B.pm line 301
# Compilation failed in require at ../lib/B/Bblock.pm line 11.
# BEGIN failed--compilation aborted at ../lib/B/Bblock.pm line 11.
# Compilation failed in require at (eval 1) line 2.
# Looks like you failed 1 tests of 1.
FAILED at test 1
ext/B/t/concise......................# Failed at ../ext/B/t/concise.t line 
11
# Failed at ../ext/B/t/concise.t line 20
#      got undef
# expected '1'
# Failed at ../ext/B/t/concise.t line 24
#      got undef
# expected '2'
# Failed at ../ext/B/t/concise.t line 26
#      got undef
# expected '1'
FAILED at test 1
ext/B/t/debug........................FAILED at test 1
ext/B/t/deparse......................Can't load '../lib/auto/B/B.so' for 
module B: dynamic linker: ./perl: relocation error: symbol not found: 
PL_opargs at ../lib/XSLoader.pm line 83.
at ../lib/B.pm line 301
Compilation failed in require at ../lib/B/Deparse.pm line 21.
BEGIN failed--compilation aborted at ../lib/B/Deparse.pm line 21.
Compilation failed in require at ../ext/B/t/deparse.t line 20.
BEGIN failed--compilation aborted at ../ext/B/t/deparse.t line 20.
FAILED at test 0
ext/B/t/lint.........................# Failed at ../ext/B/t/lint.t line 21
#      got 'Can\'t load '../lib/auto/B/B.so' for module B: dynamic linker: 
./perl: relocation error: symbol not found: PL_opargs at ../lib/XSLoader.pm 
line 83.
#  at ../lib/B.pm line 301
# Compilation failed in require at ../lib/O.pm line 5.
# BEGIN failed--compilation aborted at ../lib/O.pm line 5.
# Compilation failed in require.
# BEGIN failed--compilation aborted.
# '
# expected 'Implicit scalar context for array in scalar assignment at -e 
line 1
# '
# Failed at ../ext/B/t/lint.t line 21
#      got 'Can\'t load '../lib/auto/B/B.so' for module B: dynamic linker: 
./perl: relocation error: symbol not found: PL_opargs at ../lib/XSLoader.pm 
line 83.
#  at ../lib/B.pm line 301
# Compilation failed in require at ../lib/O.pm line 5.
# BEGIN failed--compilation aborted at ../lib/O.pm line 5.
# Compilation failed in require.
# BEGIN failed--compilation aborted.
# '
# expected 'Implicit scalar context for array in length at -e line 1
# '
FAILED at test 1
ext/B/t/o............................# Failed at ../ext/B/t/o.t line 28
# Failed at ../ext/B/t/o.t line 33
#      got 'Can\'t load '../lib/auto/B/B.so' for module B: dynamic linker: 
./perl: relocation error: symbol not found: PL_opargs at ../lib/XSLoader.pm 
line 83.'
# expected 'Compiling!'
# Failed at ../ext/B/t/o.t line 34
#      got ' at ../lib/B.pm line 301'
# expected '(foo) <bar>'
# Failed at ../ext/B/t/o.t line 35
#      got 'Compilation failed in require at ../lib/O.pm line 5.'
# expected '[]'
# Failed at ../ext/B/t/o.t line 36
#      got 'BEGIN failed--compilation aborted at ../lib/O.pm line 5.'
# expected '-e syntax OK'
FAILED at test 1
ext/B/t/showlex......................FAILED at test 1
ext/B/t/stash........................ok
ext/B/t/terse........................#     Failed test (../ext/B/t/terse.t 
at line 10)
#     Tried to use 'B::Terse'.
#     Error:  Can't load '../lib/auto/B/B.so' for module B: dynamic linker: 
./perl: relocation error: symbol not found: PL_opargs at ../lib/XSLoader.pm 
line 83.
#  at ../lib/B.pm line 301
# Compilation failed in require at ../lib/B/Terse.pm line 7.
# BEGIN failed--compilation aborted at ../lib/B/Terse.pm line 7.
# Compilation failed in require at (eval 1) line 2.
Undefined subroutine &B::Terse::indent called at ../ext/B/t/terse.t line 13.
# Looks like you planned 15 tests but only ran 1.
# Looks like your test died just after 1.
FAILED at test 1
ext/B/t/xref.........................#     Failed test (../ext/B/t/xref.t at 
line 50)
#     Tried to use 'B::Xref'.
#     Error:  Can't load '../lib/auto/B/B.so' for module B: dynamic linker: 
./perl: relocation error: symbol not found: PL_opargs at ../lib/XSLoader.pm 
line 83.
#  at ../lib/B.pm line 301
# Compilation failed in require at ../lib/B/Xref.pm line 97.
# BEGIN failed--compilation aborted at ../lib/B/Xref.pm line 97.
# Compilation failed in require at (eval 1) line 2.
Undefined subroutine &B::Xref::compile called at ../ext/B/t/xref.t line 100.
# Looks like you planned 14 tests but only ran 1.
# Looks like your test died just after 1.
FAILED at test 1
ext/Cwd/t/cwd........................Undefined subroutine &Cwd::fastcwd 
called at ../ext/Cwd/t/cwd.t line 67.
# Looks like you planned 16 tests but only ran 4.
# Looks like your test died just after 4.
FAILED at test 5
ext/Cwd/t/taint......................Can't load 
'../lib/auto/List/Util/Util.so' for module List::Util: dynamic linker: 
./perl: relocation error: symbol not found: PL_stack_sp at 
../lib/DynaLoader.pm line 229.
at ../lib/Scalar/Util.pm line 10
Compilation failed in require at ../lib/Scalar/Util.pm line 10.
Compilation failed in require at ../ext/Cwd/t/taint.t line 11.
BEGIN failed--compilation aborted at ../ext/Cwd/t/taint.t line 11.
# No tests run!
FAILED at test 1
ext/Data/Dumper/t/dumper.............Can't load 
'../lib/auto/Data/Dumper/Dumper.so' for module Data::Dumper: dynamic linker: 
./perl: relocation error: symbol not found: PL_utf8skip at 
../lib/XSLoader.pm line 83.
at ../lib/Data/Dumper.pm line 27
Compilation failed in require at ../ext/Data/Dumper/t/dumper.t line 16.
BEGIN failed--compilation aborted at ../ext/Data/Dumper/t/dumper.t line 16.
FAILED at test 0
ext/Data/Dumper/t/overload...........Can't load 
'../lib/auto/Data/Dumper/Dumper.so' for module Data::Dumper: dynamic linker: 
./perl: relocation error: symbol not found: PL_utf8skip at 
../lib/XSLoader.pm line 83.
at ../lib/Data/Dumper.pm line 27
Compilation failed in require at ../ext/Data/Dumper/t/overload.t line 13.
BEGIN failed--compilation aborted at ../ext/Data/Dumper/t/overload.t line 
13.
FAILED at test 0
ext/DB_File/t/db-btree...............skipping test on this platform
ext/DB_File/t/db-hash................skipping test on this platform
ext/DB_File/t/db-recno...............skipping test on this platform
ext/Devel/DProf/DProf................Can't load 
'../lib/auto/File/Glob/Glob.so' for module File::Glob: dynamic linker: 
./perl: relocation error: symbol not found: PL_stack_sp at 
../lib/XSLoader.pm line 83.
at ../lib/File/Glob.pm line 96
Compilation failed in require at ../ext/Devel/DProf/DProf.t line 27.
BEGIN failed--compilation aborted at ../ext/Devel/DProf/DProf.t line 27.
FAILED at test 0
ext/Devel/Peek/Peek..................Can't load 
'../lib/auto/Devel/Peek/Peek.so' for module Devel::Peek: dynamic linker: 
./perl: relocation error: symbol not found: PL_runops at ../lib/XSLoader.pm 
line 83.
at ../lib/Devel/Peek.pm line 20
Compilation failed in require at ../ext/Devel/Peek/Peek.t line 13.
BEGIN failed--compilation aborted at ../ext/Devel/Peek/Peek.t line 13.
FAILED at test 0
ext/Devel/PPPort/t/test..............Can't load 
'../lib/auto/Devel/PPPort/PPPort.so' for module Devel::PPPort: dynamic 
linker: ./perl: relocation error: symbol not found: PL_stack_sp at 
../lib/DynaLoader.pm line 229.
at ../ext/Devel/PPPort/t/test.t line 6
Compilation failed in require at ../ext/Devel/PPPort/t/test.t line 6.
BEGIN failed--compilation aborted at ../ext/Devel/PPPort/t/test.t line 6.
FAILED at test 0
ext/Digest/MD5/t/align...............Can't load 
'../lib/auto/Digest/MD5/MD5.so' for module Digest::MD5: dynamic linker: 
./perl: relocation error: symbol not found: PL_stack_sp at 
../lib/DynaLoader.pm line 229.
at ../ext/Digest/MD5/t/align.t line 11
Compilation failed in require at ../ext/Digest/MD5/t/align.t line 11.
BEGIN failed--compilation aborted at ../ext/Digest/MD5/t/align.t line 11.
FAILED at test 0
ext/Digest/MD5/t/badfile.............Can't load 
'../lib/auto/Digest/MD5/MD5.so' for module Digest::MD5: dynamic linker: 
./perl: relocation error: symbol not found: PL_stack_sp at 
../lib/DynaLoader.pm line 229.
at ../ext/Digest/MD5/t/badfile.t line 6
Compilation failed in require at ../ext/Digest/MD5/t/badfile.t line 6.
BEGIN failed--compilation aborted at ../ext/Digest/MD5/t/badfile.t line 6.
FAILED at test 0
ext/Digest/MD5/t/files...............Can't load 
'../lib/auto/Digest/MD5/MD5.so' for module Digest::MD5: dynamic linker: 
./perl: relocation error: symbol not found: PL_stack_sp at 
../lib/DynaLoader.pm line 229.
at ../ext/Digest/MD5/t/files.t line 11
Compilation failed in require at ../ext/Digest/MD5/t/files.t line 11.
BEGIN failed--compilation aborted at ../ext/Digest/MD5/t/files.t line 11.
FAILED at test 0
ext/Digest/MD5/t/md5-aaa.............Can't load 
'../lib/auto/Digest/MD5/MD5.so' for module Digest::MD5: dynamic linker: 
./perl: relocation error: symbol not found: PL_stack_sp at 
../lib/DynaLoader.pm line 229.
at ../ext/Digest/MD5/t/md5-aaa.t line 11
Compilation failed in require at ../ext/Digest/MD5/t/md5-aaa.t line 11.
BEGIN failed--compilation aborted at ../ext/Digest/MD5/t/md5-aaa.t line 11.
FAILED at test 0
ext/Digest/MD5/t/utf8................Can't load 
'../lib/auto/Digest/MD5/MD5.so' for module Digest::MD5: dynamic linker: 
./perl: relocation error: symbol not found: PL_stack_sp at 
../lib/DynaLoader.pm line 229.
at ../ext/Digest/MD5/t/utf8.t line 11
Compilation failed in require at ../ext/Digest/MD5/t/utf8.t line 11.
BEGIN failed--compilation aborted at ../ext/Digest/MD5/t/utf8.t line 11.
FAILED at test 0
ext/Encode/t/Aliases.................Can't load 
'../lib/auto/Encode/Encode.so' for module Encode: dynamic linker: ./perl: 
relocation error: symbol not found: PL_stack_sp at ../lib/XSLoader.pm line 
83.
at ../lib/Encode.pm line 9
Compilation failed in require at ../ext/Encode/t/Aliases.t line 16.
BEGIN failed--compilation aborted at ../ext/Encode/t/Aliases.t line 16.
FAILED at test 0
ext/Encode/t/at-cn...................Can't load 
'../lib/auto/Encode/Encode.so' for module Encode: dynamic linker: ./perl: 
relocation error: symbol not found: PL_stack_sp at ../lib/XSLoader.pm line 
83.
at ../lib/Encode.pm line 9
Compilation failed in require at ../ext/Encode/t/at-cn.t line 20.
BEGIN failed--compilation aborted at ../ext/Encode/t/at-cn.t line 20.
# No tests run!
FAILED at test 1
ext/Encode/t/at-tw...................Can't load 
'../lib/auto/Encode/Encode.so' for module Encode: dynamic linker: ./perl: 
relocation error: symbol not found: PL_stack_sp at ../lib/XSLoader.pm line 
83.
at ../lib/Encode.pm line 9
Compilation failed in require at ../ext/Encode/t/at-tw.t line 22.
BEGIN failed--compilation aborted at ../ext/Encode/t/at-tw.t line 22.
# No tests run!
FAILED at test 1
ext/Encode/t/CJKT....................Can't load 
'../lib/auto/Encode/Encode.so' for module Encode: dynamic linker: ./perl: 
relocation error: symbol not found: PL_stack_sp at ../lib/XSLoader.pm line 
83.
at ../lib/Encode.pm line 9
Compilation failed in require at ../ext/Encode/t/CJKT.t line 25.
BEGIN failed--compilation aborted at ../ext/Encode/t/CJKT.t line 25.
# No tests run!
FAILED at test 1
ext/Encode/t/Encode..................Can't load 
'../lib/auto/Encode/Encode.so' for module Encode: dynamic linker: ./perl: 
relocation error: symbol not found: PL_stack_sp at ../lib/XSLoader.pm line 
83.
at ../lib/Encode.pm line 9
Compilation failed in require at ../ext/Encode/t/Encode.t line 16.
BEGIN failed--compilation aborted at ../ext/Encode/t/Encode.t line 16.
FAILED at test 0
ext/Encode/t/Encoder.................Can't load 
'../lib/auto/Encode/Encode.so' for module Encode: dynamic linker: ./perl: 
relocation error: symbol not found: PL_stack_sp at ../lib/XSLoader.pm line 
83.
at ../lib/Encode.pm line 9
Compilation failed in require at ../lib/Encode/Encoder.pm line 15.
BEGIN failed--compilation aborted at ../lib/Encode/Encoder.pm line 15.
Compilation failed in require at ../ext/Encode/t/Encoder.t line 17.
BEGIN failed--compilation aborted at ../ext/Encode/t/Encoder.t line 17.
# No tests run!
FAILED at test 1
ext/Encode/t/encoding................Can't load 
'../lib/auto/Encode/Encode.so' for module Encode: dynamic linker: ./perl: 
relocation error: symbol not found: PL_stack_sp at ../lib/XSLoader.pm line 
83.
at ../lib/Encode.pm line 9
Compilation failed in require at ../lib/encoding.pm line 4.
BEGIN failed--compilation aborted at ../lib/encoding.pm line 4.
Compilation failed in require at ../ext/Encode/t/encoding.t line 19.
BEGIN failed--compilation aborted at ../ext/Encode/t/encoding.t line 19.
FAILED at test 0
ext/Encode/t/fallback................Can't load 
'../lib/auto/Encode/Encode.so' for module Encode: dynamic linker: ./perl: 
relocation error: symbol not found: PL_stack_sp at ../lib/XSLoader.pm line 
83.
at ../lib/Encode.pm line 9
Compilation failed in require at ../ext/Encode/t/fallback.t line 21.
BEGIN failed--compilation aborted at ../ext/Encode/t/fallback.t line 21.
# No tests run!
FAILED at test 1
ext/Encode/t/grow....................Can't load 
'../lib/auto/Encode/Encode.so' for module Encode: dynamic linker: ./perl: 
relocation error: symbol not found: PL_stack_sp at ../lib/XSLoader.pm line 
83.
at ../lib/Encode.pm line 9
Compilation failed in require at ../ext/Encode/t/grow.t line 17.
BEGIN failed--compilation aborted at ../ext/Encode/t/grow.t line 17.
FAILED at test 0
ext/Encode/t/guess...................Can't load 
'../lib/auto/Encode/Encode.so' for module Encode: dynamic linker: ./perl: 
relocation error: symbol not found: PL_stack_sp at ../lib/XSLoader.pm line 
83.
at ../lib/Encode.pm line 9
Compilation failed in require at ../ext/Encode/t/guess.t line 21.
BEGIN failed--compilation aborted at ../ext/Encode/t/guess.t line 21.
FAILED at test 0
ext/Encode/t/jperl...................Can't load 
'../lib/auto/Encode/Encode.so' for module Encode: dynamic linker: ./perl: 
relocation error: symbol not found: PL_stack_sp at ../lib/XSLoader.pm line 
83.
at ../lib/Encode.pm line 9
Compilation failed in require at ../lib/encoding.pm line 4.
BEGIN failed--compilation aborted at ../lib/encoding.pm line 4.
Compilation failed in require at ../ext/Encode/t/jperl.t line 29.
BEGIN failed--compilation aborted at ../ext/Encode/t/jperl.t line 29.
# No tests run!
FAILED at test 1
ext/Encode/t/mime-header.............#     Failed test 
(../ext/Encode/t/mime-header.t at line 27)
#     Tried to use 'Encode::MIME::Header'.
#     Error:  Can't load '../lib/auto/Encode/Encode.so' for module Encode: 
dynamic linker: ./perl: relocation error: symbol not found: PL_stack_sp at 
../lib/XSLoader.pm line 83.
#  at ../lib/Encode.pm line 9
# Compilation failed in require at ../lib/Encode/MIME/Header.pm line 6.
# BEGIN failed--compilation aborted at ../lib/Encode/MIME/Header.pm line 6.
# Compilation failed in require at (eval 1) line 2.
Unknown encoding 'MIME-Header' at ../ext/Encode/t/mime-header.t line 44
# Looks like you planned 6 tests but only ran 1.
# Looks like your test died just after 1.
FAILED at test 1
ext/Encode/t/perlio..................Can't load '../lib/auto/IO/IO.so' for 
module IO: dynamic linker: ./perl: relocation error: symbol not found: 
PL_stack_sp at ../lib/XSLoader.pm line 83.
at ../lib/IO.pm line 9
Compilation failed in require at ../lib/IO/Handle.pm line 256.
BEGIN failed--compilation aborted at ../lib/IO/Handle.pm line 256.
Compilation failed in require at ../lib/IO/Seekable.pm line 101.
BEGIN failed--compilation aborted at ../lib/IO/Seekable.pm line 101.
Compilation failed in require at ../lib/IO/File.pm line 112.
BEGIN failed--compilation aborted at ../lib/IO/File.pm line 112.
Compilation failed in require at ../lib/FileHandle.pm line 9.
Compilation failed in require at ../ext/Encode/t/perlio.t line 27.
BEGIN failed--compilation aborted at ../ext/Encode/t/perlio.t line 27.
FAILED at test 0
ext/Encode/t/Unicode.................Can't load 
'../lib/auto/Encode/Encode.so' for module Encode: dynamic linker: ./perl: 
relocation error: symbol not found: PL_stack_sp at ../lib/XSLoader.pm line 
83.
at ../lib/Encode.pm line 9
Compilation failed in require at ../ext/Encode/t/Unicode.t line 22.
BEGIN failed--compilation aborted at ../ext/Encode/t/Unicode.t line 22.
# No tests run!
FAILED at test 1
ext/Errno/Errno......................ok
ext/Fcntl/t/fcntl....................Can't load '../lib/auto/Fcntl/Fcntl.so' 
for module Fcntl: dynamic linker: ./perl: relocation error: symbol not 
found: PL_stack_sp at ../lib/XSLoader.pm line 83.
at ../lib/Fcntl.pm line 214
Compilation failed in require at ../ext/Fcntl/t/fcntl.t line 13.
BEGIN failed--compilation aborted at ../ext/Fcntl/t/fcntl.t line 13.
FAILED at test 0
ext/Fcntl/t/syslfs...................skipping test on this platform
ext/File/Glob/t/basic................Can't load 
'../lib/auto/File/Glob/Glob.so' for module File::Glob: dynamic linker: 
./perl: relocation error: symbol not found: PL_stack_sp at 
../lib/XSLoader.pm line 83.
at ../lib/File/Glob.pm line 96
Compilation failed in require at ../ext/File/Glob/t/basic.t line 21.
BEGIN failed--compilation aborted at ../ext/File/Glob/t/basic.t line 21.
FAILED at test 1
ext/File/Glob/t/case.................Can't load 
'../lib/auto/File/Glob/Glob.so' for module File::Glob: dynamic linker: 
./perl: relocation error: symbol not found: PL_stack_sp at 
../lib/XSLoader.pm line 83.
at ../lib/File/Glob.pm line 96
Compilation failed in require at ../ext/File/Glob/t/case.t line 21.
BEGIN failed--compilation aborted at ../ext/File/Glob/t/case.t line 21.
FAILED at test 1
ext/File/Glob/t/global...............Can't load 
'../lib/auto/File/Glob/Glob.so' for module File::Glob: dynamic linker: 
./perl: relocation error: symbol not found: PL_stack_sp at 
../lib/XSLoader.pm line 83.
at ../lib/File/Glob.pm line 96
Compilation failed in require at ../ext/File/Glob/t/global.t line 35.
BEGIN failed--compilation aborted at ../ext/File/Glob/t/global.t line 35.
FAILED at test 1
ext/File/Glob/t/taint................Can't load 
'../lib/auto/File/Glob/Glob.so' for module File::Glob: dynamic linker: 
./perl: relocation error: symbol not found: PL_stack_sp at 
../lib/XSLoader.pm line 83.
at ../lib/File/Glob.pm line 96
Compilation failed in require at ../ext/File/Glob/t/taint.t line 21.
BEGIN failed--compilation aborted at ../ext/File/Glob/t/taint.t line 21.
FAILED at test 1
ext/Filter/t/call....................FAILED at test 2
ext/GDBM_File/gdbm...................skipping test on this platform
ext/I18N/Langinfo/Langinfo...........Can't load 
'../lib/auto/I18N/Langinfo/Langinfo.so' for module I18N::Langinfo: dynamic 
linker: ./perl: relocation error: symbol not found: PL_stack_sp at 
../lib/DynaLoader.pm line 229.
at ../ext/I18N/Langinfo/Langinfo.t line 15
Compilation failed in require at ../ext/I18N/Langinfo/Langinfo.t line 15.
BEGIN failed--compilation aborted at ../ext/I18N/Langinfo/Langinfo.t line 
15.
FAILED at test 0
ext/IO/lib/IO/t/io_const.............Can't load '../lib/auto/IO/IO.so' for 
module IO: dynamic linker: ./perl: relocation error: symbol not found: 
PL_stack_sp at ../lib/XSLoader.pm line 83.
at ../lib/IO.pm line 9
Compilation failed in require at ../lib/IO/Handle.pm line 256.
BEGIN failed--compilation aborted at ../lib/IO/Handle.pm line 256.
Compilation failed in require at ../ext/IO/lib/IO/t/io_const.t line 20.
BEGIN failed--compilation aborted at ../ext/IO/lib/IO/t/io_const.t line 20.
FAILED at test 0
ext/IO/lib/IO/t/io_dir...............Can't load '../lib/auto/IO/IO.so' for 
module IO: dynamic linker: ./perl: relocation error: symbol not found: 
PL_stack_sp at ../lib/XSLoader.pm line 83.
at ../lib/IO.pm line 9
Compilation failed in require at ../lib/IO/Handle.pm line 256.
BEGIN failed--compilation aborted at ../lib/IO/Handle.pm line 256.
Compilation failed in require at ../lib/IO/Seekable.pm line 101.
BEGIN failed--compilation aborted at ../lib/IO/Seekable.pm line 101.
Compilation failed in require at ../lib/IO/File.pm line 112.
BEGIN failed--compilation aborted at ../lib/IO/File.pm line 112.
Compilation failed in require at ../lib/IO/Dir.pm line 15.
BEGIN failed--compilation aborted at ../lib/IO/Dir.pm line 15.
Compilation failed in require at ../ext/IO/lib/IO/t/io_dir.t line 18.
BEGIN failed--compilation aborted at ../ext/IO/lib/IO/t/io_dir.t line 18.
FAILED at test 0
ext/IO/lib/IO/t/io_dup...............Can't load '../lib/auto/IO/IO.so' for 
module IO: dynamic linker: ./perl: relocation error: symbol not found: 
PL_stack_sp at ../lib/XSLoader.pm line 83.
at ../lib/IO.pm line 9
Compilation failed in require at ../lib/IO/Handle.pm line 256.
BEGIN failed--compilation aborted at ../lib/IO/Handle.pm line 256.
Compilation failed in require at ../ext/IO/lib/IO/t/io_dup.t line 21.
BEGIN failed--compilation aborted at ../ext/IO/lib/IO/t/io_dup.t line 21.
FAILED at test 0
ext/IO/lib/IO/t/io_linenum...........Can't load '../lib/auto/IO/IO.so' for 
module IO: dynamic linker: ./perl: relocation error: symbol not found: 
PL_stack_sp at ../lib/XSLoader.pm line 83.
at ../lib/IO.pm line 9
Compilation failed in require at ../lib/IO/Handle.pm line 256.
BEGIN failed--compilation aborted at ../lib/IO/Handle.pm line 256.
Compilation failed in require at ../lib/IO/Seekable.pm line 101.
BEGIN failed--compilation aborted at ../lib/IO/Seekable.pm line 101.
Compilation failed in require at ../lib/IO/File.pm line 112.
BEGIN failed--compilation aborted at ../lib/IO/File.pm line 112.
Compilation failed in require at ../ext/IO/lib/IO/t/io_linenum.t line 24.
BEGIN failed--compilation aborted at ../ext/IO/lib/IO/t/io_linenum.t line 
24.
FAILED at test 1
ext/IO/lib/IO/t/io_multihomed........Can't load 
'../lib/auto/Socket/Socket.so' for module Socket: dynamic linker: ./perl: 
relocation error: symbol not found: PL_stack_sp at ../lib/XSLoader.pm line 
83.
at ../lib/Socket.pm line 399
Compilation failed in require at ../ext/IO/lib/IO/t/io_multihomed.t line 44.
BEGIN failed--compilation aborted at ../ext/IO/lib/IO/t/io_multihomed.t line 
44.
FAILED at test 0
ext/IO/lib/IO/t/io_pipe..............Can't load '../lib/auto/IO/IO.so' for 
module IO: dynamic linker: ./perl: relocation error: symbol not found: 
PL_stack_sp at ../lib/XSLoader.pm line 83.
at ../lib/IO.pm line 9
Compilation failed in require at ../lib/IO/Handle.pm line 256.
BEGIN failed--compilation aborted at ../lib/IO/Handle.pm line 256.
Compilation failed in require at ../lib/IO/Pipe.pm line 11.
BEGIN failed--compilation aborted at ../lib/IO/Pipe.pm line 11.
Compilation failed in require at ../ext/IO/lib/IO/t/io_pipe.t line 28.
BEGIN failed--compilation aborted at ../ext/IO/lib/IO/t/io_pipe.t line 28.
FAILED at test 0
ext/IO/lib/IO/t/io_poll..............Can't load '../lib/auto/IO/IO.so' for 
module IO: dynamic linker: ./perl: relocation error: symbol not found: 
PL_stack_sp at ../lib/XSLoader.pm line 83.
at ../lib/IO.pm line 9
Compilation failed in require at ../lib/IO/Handle.pm line 256.
BEGIN failed--compilation aborted at ../lib/IO/Handle.pm line 256.
Compilation failed in require at ../ext/IO/lib/IO/t/io_poll.t line 20.
BEGIN failed--compilation aborted at ../ext/IO/lib/IO/t/io_poll.t line 20.
FAILED at test 0
ext/IO/lib/IO/t/io_sel...............ok
ext/IO/lib/IO/t/io_sock..............Can't load '../lib/auto/IO/IO.so' for 
module IO: dynamic linker: ./perl: relocation error: symbol not found: 
PL_stack_sp at ../lib/XSLoader.pm line 83.
at ../lib/IO.pm line 9
Compilation failed in require at ../lib/IO/Handle.pm line 256.
BEGIN failed--compilation aborted at ../lib/IO/Handle.pm line 256.
Compilation failed in require at ../lib/IO/Socket.pm line 11.
BEGIN failed--compilation aborted at ../lib/IO/Socket.pm line 11.
Compilation failed in require at ../ext/IO/lib/IO/t/io_sock.t line 39.
BEGIN failed--compilation aborted at ../ext/IO/lib/IO/t/io_sock.t line 39.
FAILED at test 0
ext/IO/lib/IO/t/io_taint.............Can't load '../lib/auto/IO/IO.so' for 
module IO: dynamic linker: ./perl: relocation error: symbol not found: 
PL_stack_sp at ../lib/XSLoader.pm line 83.
at ../lib/IO.pm line 9
Compilation failed in require at ../lib/IO/Handle.pm line 256.
BEGIN failed--compilation aborted at ../lib/IO/Handle.pm line 256.
Compilation failed in require at ../lib/IO/Seekable.pm line 101.
BEGIN failed--compilation aborted at ../lib/IO/Seekable.pm line 101.
Compilation failed in require at ../lib/IO/File.pm line 112.
BEGIN failed--compilation aborted at ../lib/IO/File.pm line 112.
Compilation failed in require at ../ext/IO/lib/IO/t/io_taint.t line 24.
BEGIN failed--compilation aborted at ../ext/IO/lib/IO/t/io_taint.t line 24.
FAILED at test 0
ext/IO/lib/IO/t/io_tell..............Can't load '../lib/auto/IO/IO.so' for 
module IO: dynamic linker: ./perl: relocation error: symbol not found: 
PL_stack_sp at ../lib/XSLoader.pm line 83.
at ../lib/IO.pm line 9
Compilation failed in require at ../lib/IO/Handle.pm line 256.
BEGIN failed--compilation aborted at ../lib/IO/Handle.pm line 256.
Compilation failed in require at ../lib/IO/Seekable.pm line 101.
BEGIN failed--compilation aborted at ../lib/IO/Seekable.pm line 101.
Compilation failed in require at ../lib/IO/File.pm line 112.
BEGIN failed--compilation aborted at ../lib/IO/File.pm line 112.
Compilation failed in require at ../ext/IO/lib/IO/t/io_tell.t line 27.
BEGIN failed--compilation aborted at ../ext/IO/lib/IO/t/io_tell.t line 27.
FAILED at test 0
ext/IO/lib/IO/t/io_udp...............Can't load 
'../lib/auto/Socket/Socket.so' for module Socket: dynamic linker: ./perl: 
relocation error: symbol not found: PL_stack_sp at ../lib/XSLoader.pm line 
83.
at ../lib/Socket.pm line 399
Compilation failed in require at ../ext/IO/lib/IO/t/io_udp.t line 57.
BEGIN failed--compilation aborted at ../ext/IO/lib/IO/t/io_udp.t line 57.
FAILED at test 0
ext/IO/lib/IO/t/io_unix..............Can't load '../lib/auto/IO/IO.so' for 
module IO: dynamic linker: ./perl: relocation error: symbol not found: 
PL_stack_sp at ../lib/XSLoader.pm line 83.
at ../lib/IO.pm line 9
Compilation failed in require at ../lib/IO/Handle.pm line 256.
BEGIN failed--compilation aborted at ../lib/IO/Handle.pm line 256.
Compilation failed in require at ../lib/IO/Socket.pm line 11.
BEGIN failed--compilation aborted at ../lib/IO/Socket.pm line 11.
Compilation failed in require at ../ext/IO/lib/IO/t/io_unix.t line 54.
BEGIN failed--compilation aborted at ../ext/IO/lib/IO/t/io_unix.t line 54.
FAILED at test 0
ext/IO/lib/IO/t/io_xs................Can't load '../lib/auto/IO/IO.so' for 
module IO: dynamic linker: ./perl: relocation error: symbol not found: 
PL_stack_sp at ../lib/XSLoader.pm line 83.
at ../lib/IO.pm line 9
Compilation failed in require at ../lib/IO/Handle.pm line 256.
BEGIN failed--compilation aborted at ../lib/IO/Handle.pm line 256.
Compilation failed in require at ../lib/IO/Seekable.pm line 101.
BEGIN failed--compilation aborted at ../lib/IO/Seekable.pm line 101.
Compilation failed in require at ../lib/IO/File.pm line 112.
BEGIN failed--compilation aborted at ../lib/IO/File.pm line 112.
Compilation failed in require at ../ext/IO/lib/IO/t/io_xs.t line 25.
BEGIN failed--compilation aborted at ../ext/IO/lib/IO/t/io_xs.t line 25.
FAILED at test 0
ext/IPC/SysV/ipcsysv.................Can't load 
'../lib/auto/IPC/SysV/SysV.so' for module IPC::SysV: dynamic linker: ./perl: 
relocation error: symbol not found: PL_stack_sp at ../lib/DynaLoader.pm line 
229.
at ../lib/IPC/SysV.pm line 56
Compilation failed in require at ../ext/IPC/SysV/ipcsysv.t line 28.
BEGIN failed--compilation aborted at ../ext/IPC/SysV/ipcsysv.t line 28.
FAILED at test 0
ext/IPC/SysV/t/msg...................Can't load 
'../lib/auto/IPC/SysV/SysV.so' for module IPC::SysV: dynamic linker: ./perl: 
relocation error: symbol not found: PL_stack_sp at ../lib/DynaLoader.pm line 
229.
at ../lib/IPC/SysV.pm line 56
Compilation failed in require at ../ext/IPC/SysV/t/msg.t line 23.
BEGIN failed--compilation aborted at ../ext/IPC/SysV/t/msg.t line 23.
FAILED at test 0
ext/IPC/SysV/t/sem...................Can't load 
'../lib/auto/IPC/SysV/SysV.so' for module IPC::SysV: dynamic linker: ./perl: 
relocation error: symbol not found: PL_stack_sp at ../lib/DynaLoader.pm line 
229.
at ../lib/IPC/SysV.pm line 56
Compilation failed in require at ../ext/IPC/SysV/t/sem.t line 33.
BEGIN failed--compilation aborted at ../ext/IPC/SysV/t/sem.t line 33.
FAILED at test 0
ext/List/Util/t/blessed..............Can't load 
'../lib/auto/List/Util/Util.so' for module List::Util: dynamic linker: 
./perl: relocation error: symbol not found: PL_stack_sp at 
../lib/DynaLoader.pm line 229.
at ../lib/Scalar/Util.pm line 10
Compilation failed in require at ../lib/Scalar/Util.pm line 10.
Compilation failed in require at ../ext/List/Util/t/blessed.t line 16.
BEGIN failed--compilation aborted at ../ext/List/Util/t/blessed.t line 16.
FAILED at test 0
ext/List/Util/t/dualvar..............Can't load 
'../lib/auto/List/Util/Util.so' for module List::Util: dynamic linker: 
./perl: relocation error: symbol not found: PL_stack_sp at 
../lib/DynaLoader.pm line 229.
at ../lib/Scalar/Util.pm line 10
Compilation failed in require at ../lib/Scalar/Util.pm line 10.
Compilation failed in require at ../ext/List/Util/t/dualvar.t line 19.
BEGIN failed--compilation aborted at ../ext/List/Util/t/dualvar.t line 25.
FAILED at test 0
ext/List/Util/t/first................Can't load 
'../lib/auto/List/Util/Util.so' for module List::Util: dynamic linker: 
./perl: relocation error: symbol not found: PL_stack_sp at 
../lib/DynaLoader.pm line 229.
at ../ext/List/Util/t/first.t line 16
Compilation failed in require at ../ext/List/Util/t/first.t line 16.
BEGIN failed--compilation aborted at ../ext/List/Util/t/first.t line 16.
FAILED at test 0
ext/List/Util/t/max..................Can't load 
'../lib/auto/List/Util/Util.so' for module List::Util: dynamic linker: 
./perl: relocation error: symbol not found: PL_stack_sp at 
../lib/DynaLoader.pm line 229.
at ../ext/List/Util/t/max.t line 17
Compilation failed in require at ../ext/List/Util/t/max.t line 17.
BEGIN failed--compilation aborted at ../ext/List/Util/t/max.t line 17.
FAILED at test 0
ext/List/Util/t/maxstr...............Can't load 
'../lib/auto/List/Util/Util.so' for module List::Util: dynamic linker: 
./perl: relocation error: symbol not found: PL_stack_sp at 
../lib/DynaLoader.pm line 229.
at ../ext/List/Util/t/maxstr.t line 17
Compilation failed in require at ../ext/List/Util/t/maxstr.t line 17.
BEGIN failed--compilation aborted at ../ext/List/Util/t/maxstr.t line 17.
FAILED at test 0
ext/List/Util/t/min..................Can't load 
'../lib/auto/List/Util/Util.so' for module List::Util: dynamic linker: 
./perl: relocation error: symbol not found: PL_stack_sp at 
../lib/DynaLoader.pm line 229.
at ../ext/List/Util/t/min.t line 17
Compilation failed in require at ../ext/List/Util/t/min.t line 17.
BEGIN failed--compilation aborted at ../ext/List/Util/t/min.t line 17.
FAILED at test 0
ext/List/Util/t/minstr...............Can't load 
'../lib/auto/List/Util/Util.so' for module List::Util: dynamic linker: 
./perl: relocation error: symbol not found: PL_stack_sp at 
../lib/DynaLoader.pm line 229.
at ../ext/List/Util/t/minstr.t line 17
Compilation failed in require at ../ext/List/Util/t/minstr.t line 17.
BEGIN failed--compilation aborted at ../ext/List/Util/t/minstr.t line 17.
FAILED at test 0
ext/List/Util/t/openhan..............Can't load 
'../lib/auto/List/Util/Util.so' for module List::Util: dynamic linker: 
./perl: relocation error: symbol not found: PL_stack_sp at 
../lib/DynaLoader.pm line 229.
at ../lib/Scalar/Util.pm line 10
Compilation failed in require at ../lib/Scalar/Util.pm line 10.
Compilation failed in require at ../ext/List/Util/t/openhan.t line 17.
BEGIN failed--compilation aborted at ../ext/List/Util/t/openhan.t line 17.
FAILED at test 0
ext/List/Util/t/readonly.............Can't load 
'../lib/auto/List/Util/Util.so' for module List::Util: dynamic linker: 
./perl: relocation error: symbol not found: PL_stack_sp at 
../lib/DynaLoader.pm line 229.
at ../lib/Scalar/Util.pm line 10
Compilation failed in require at ../lib/Scalar/Util.pm line 10.
Compilation failed in require at ../ext/List/Util/t/readonly.t line 16.
BEGIN failed--compilation aborted at ../ext/List/Util/t/readonly.t line 16.
FAILED at test 0
ext/List/Util/t/reduce...............Can't load 
'../lib/auto/List/Util/Util.so' for module List::Util: dynamic linker: 
./perl: relocation error: symbol not found: PL_stack_sp at 
../lib/DynaLoader.pm line 229.
at ../ext/List/Util/t/reduce.t line 17
Compilation failed in require at ../ext/List/Util/t/reduce.t line 17.
BEGIN failed--compilation aborted at ../ext/List/Util/t/reduce.t line 17.
FAILED at test 0
ext/List/Util/t/reftype..............Can't load 
'../lib/auto/List/Util/Util.so' for module List::Util: dynamic linker: 
./perl: relocation error: symbol not found: PL_stack_sp at 
../lib/DynaLoader.pm line 229.
at ../lib/Scalar/Util.pm line 10
Compilation failed in require at ../lib/Scalar/Util.pm line 10.
Compilation failed in require at ../ext/List/Util/t/reftype.t line 17.
BEGIN failed--compilation aborted at ../ext/List/Util/t/reftype.t line 17.
FAILED at test 0
ext/List/Util/t/shuffle..............Can't load 
'../lib/auto/List/Util/Util.so' for module List::Util: dynamic linker: 
./perl: relocation error: symbol not found: PL_stack_sp at 
../lib/DynaLoader.pm line 229.
at ../ext/List/Util/t/shuffle.t line 17
Compilation failed in require at ../ext/List/Util/t/shuffle.t line 17.
BEGIN failed--compilation aborted at ../ext/List/Util/t/shuffle.t line 17.
FAILED at test 0
ext/List/Util/t/sum..................Can't load 
'../lib/auto/List/Util/Util.so' for module List::Util: dynamic linker: 
./perl: relocation error: symbol not found: PL_stack_sp at 
../lib/DynaLoader.pm line 229.
at ../ext/List/Util/t/sum.t line 17
Compilation failed in require at ../ext/List/Util/t/sum.t line 17.
BEGIN failed--compilation aborted at ../ext/List/Util/t/sum.t line 17.
FAILED at test 0
ext/List/Util/t/tainted..............Can't load 
'../lib/auto/List/Util/Util.so' for module List::Util: dynamic linker: 
./perl: relocation error: symbol not found: PL_stack_sp at 
../lib/DynaLoader.pm line 229.
at ../lib/Scalar/Util.pm line 10
Compilation failed in require at ../lib/Scalar/Util.pm line 10.
Compilation failed in require at ../ext/List/Util/t/tainted.t line 17.
BEGIN failed--compilation aborted at ../ext/List/Util/t/tainted.t line 17.
FAILED at test 0
ext/List/Util/t/weak.................Can't load 
'../lib/auto/List/Util/Util.so' for module List::Util: dynamic linker: 
./perl: relocation error: symbol not found: PL_stack_sp at 
../lib/DynaLoader.pm line 229.
at ../lib/Scalar/Util.pm line 10
Compilation failed in require at ../lib/Scalar/Util.pm line 10.
Compilation failed in require at ../ext/List/Util/t/weak.t line 20.
BEGIN failed--compilation aborted at ../ext/List/Util/t/weak.t line 34.
FAILED at test 0
ext/MIME/Base64/t/base64.............FAILED at test 284
ext/MIME/Base64/t/quoted-print.......ok
ext/MIME/Base64/t/unicode............FAILED at test 1
ext/NDBM_File/ndbm...................Can't load '../lib/auto/Fcntl/Fcntl.so' 
for module Fcntl: dynamic linker: ./perl: relocation error: symbol not 
found: PL_stack_sp at ../lib/XSLoader.pm line 83.
at ../lib/Fcntl.pm line 214
Compilation failed in require at ../ext/NDBM_File/ndbm.t line 29.
BEGIN failed--compilation aborted at ../ext/NDBM_File/ndbm.t line 29.
FAILED at test 0
ext/ODBM_File/odbm...................skipping test on this platform
ext/Opcode/Opcode....................Can't load 
'../lib/auto/Opcode/Opcode.so' for module Opcode: dynamic linker: ./perl: 
relocation error: symbol not found: PL_maxo at ../lib/XSLoader.pm line 83.
at ../lib/Opcode.pm line 32
Compilation failed in require at ../ext/Opcode/Opcode.t line 19.
BEGIN failed--compilation aborted at ../ext/Opcode/Opcode.t line 19.
FAILED at test 0
ext/Opcode/ops.......................FAILED at test 1
ext/PerlIO/PerlIO....................Can't load 
'../lib/auto/PerlIO/scalar/scalar.so' for module PerlIO::scalar: dynamic 
linker: ./perl: relocation error: symbol not found: PerlIOBase_binmode at 
../lib/XSLoader.pm line 83.
at ../lib/PerlIO/scalar.pm line 4
Compilation failed in require at (eval 9) line 3.
#     Failed test (../ext/PerlIO/PerlIO.t at line 0)
#     Failed test (../ext/PerlIO/PerlIO.t at line 98)
#     Failed test (../ext/PerlIO/PerlIO.t at line 101)
#     Failed test (../ext/PerlIO/PerlIO.t at line 104)
#     Failed test (../ext/PerlIO/PerlIO.t at line 105)
#          got: undef
#     expected: 'ok
# '
#     Failed test (../ext/PerlIO/PerlIO.t at line 106)
FAILED at test 30
ext/PerlIO/t/encoding................Can't load 
'../lib/auto/Encode/Encode.so' for module Encode: dynamic linker: ./perl: 
relocation error: symbol not found: PL_stack_sp at ../lib/XSLoader.pm line 
83.
at ../lib/Encode.pm line 9
Compilation failed in require at ../ext/PerlIO/t/encoding.t line 31.
BEGIN failed--compilation aborted at ../ext/PerlIO/t/encoding.t line 31.
FAILED at test 0
ext/PerlIO/t/fail....................ok
ext/PerlIO/t/fallback................Can't load 
'../lib/auto/Encode/Encode.so' for module Encode: dynamic linker: ./perl: 
relocation error: symbol not found: PL_stack_sp at ../lib/XSLoader.pm line 
83.
at ../lib/Encode.pm line 9
Compilation failed in require at ../ext/PerlIO/t/fallback.t line 15.
BEGIN failed--compilation aborted at ../ext/PerlIO/t/fallback.t line 15.
# Looks like you planned 9 tests but ran 0.
FAILED at test 1
ext/PerlIO/t/scalar..................Can't load 
'../lib/auto/PerlIO/scalar/scalar.so' for module PerlIO::scalar: dynamic 
linker: ./perl: relocation error: symbol not found: PerlIOBase_binmode at 
../lib/XSLoader.pm line 83.
at ../lib/PerlIO/scalar.pm line 4
Compilation failed in require at (eval 1) line 3.
FAILED at test 1
ext/PerlIO/t/via.....................Can't load 
'../lib/auto/PerlIO/via/via.so' for module PerlIO::via: dynamic linker: 
./perl: relocation error: symbol not found: PL_stack_sp at 
../lib/XSLoader.pm line 83.
at ../lib/PerlIO/via.pm line 4
Compilation failed in require at (eval 2) line 3.
perlio: unknown layer "via".
perlio: unknown layer "via".
#     Failed test (../ext/PerlIO/t/via.t at line 0)
print() on closed filehandle $fh at ../ext/PerlIO/t/via.t line 27.
#     Failed test (../ext/PerlIO/t/via.t at line 27)
#     Failed test (../ext/PerlIO/t/via.t at line 28)
perlio: unknown layer "via".
#     Failed test (../ext/PerlIO/t/via.t at line 0)
readline() on closed filehandle $fh at ../ext/PerlIO/t/via.t line 31.
#     Failed test (../ext/PerlIO/t/via.t at line 32)
#     Failed test (../ext/PerlIO/t/via.t at line 34)



_        ___
|_)        |
| \ICHARD  |HOMAS.

rich_d_thomas@bigfoot.com

rdthomas.welcome.to

_________________________________________________________________
Get Hotmail on your mobile phone http://www.msn.co.uk/msnmobile


Thread Next


nntp.perl.org: Perl Programming lists via nntp and http.
Comments to Ask Bjørn Hansen at ask@perl.org | Group listing | About