develooper Front page | perl.perl5.porters | Postings from May 2003

Smoke [5.9.0] 19460 FAIL(Fm) windows nt 4.0 (x86)

Thread Next
From:
Abe Timmerman
Date:
May 11, 2003 08:26
Subject:
Smoke [5.9.0] 19460 FAIL(Fm) windows nt 4.0 (x86)
Message ID:
200305111724.17709.abe@ztreet.demon.nl
Automated smoke report for 5.9.0 patch 19460 on windows nt - 4.0 (x86)
(browey) using  version
Report generated by Test::Smoke v1.17.01

O = OK  F = Failure(s), extended report at the bottom
? = still running or test results not (yet) available
Build failures during:       - = unknown or N/A
    c = Configure, m = make, t = make test-prep

   19460     Configuration (common) -DCCHOME=C:\MinGW -DCCTYPE=GCC -Dgcc_v3_2
------------ ----------------------------------------------------------------
F F F F      -Duseithreads
m m m m      -Duseithreads -Duselargefiles
| | | +----- PERLIO = perlio -DDEBUGGING
| | +------- PERLIO = stdio  -DDEBUGGING
| +--------- PERLIO = perlio
+----------- PERLIO = stdio

Summary: FAIL(Fm)


Failures:

MSWin32     [stdio       ]-DCCTYPE=GCC -DCCHOME=C:\MinGW -Dgcc_v3_2
              (cont) -Duseithreads
    io/dup.................................FAILED tests 6-7
    io/openpid.............................FAILED tests 6, 8-9
    ../ext/Socket/socketpair...............FAILED tests 6-45
    ../lib/Devel/SelfStubber...............FAILED tests 10-11
    ../lib/ExtUtils/t/Embed................FAILED tests 1-9
    ../lib/FileHandle......................FAILED tests 11-12
    ../lib/IPC/Open2.......................FAILED test 3
    ../lib/IPC/Open3.......................FAILED tests 3-4, 10-13, 15-22
    ../lib/Net/Ping/t/450_service..........FAILED tests 8-10
    ../lib/Net/Ping/t/510_ping_udp.........FAILED test 2
    ../lib/Tie/File/t/09_gen_rs............FAILED tests 44-47
    ../lib/Tie/File/t/42_offset............dubious DIED. FAILED test 4
../lib/IPC/Open2..................FAILED test 3
../lib/Net/Ping/t/510_ping_udp....FAILED test 2
../lib/Tie/File/t/42_offset.......dubiousD. FAILED test 4
../lib/IPC/Open2..................FAILED test 3
../lib/Net/Ping/t/510_ping_udp....FAILED test 2
../lib/Tie/File/t/42_offset.......dubiousD. FAILED test 4

MSWin32     [perlio      ]-DCCTYPE=GCC -DCCHOME=C:\MinGW -Dgcc_v3_2
              (cont) -Duseithreads
    io/dup.................................FAILED tests 6-7
    io/openpid.............................FAILED test 9
    ../lib/Devel/SelfStubber...............FAILED tests 10-11
    ../lib/ExtUtils/t/Embed................FAILED tests 1-9
    ../lib/Net/Ping/t/450_service..........FAILED tests 8-10
    ../lib/Net/Ping/t/510_ping_udp.........FAILED test 2
    ../lib/Tie/File/t/09_gen_rs............FAILED tests 44-47
    ../lib/Tie/File/t/16_handle............FAILED tests 3, 5, 7, 9, 11, 13,
 15, 17, 19, 21, 23, 25, 27, 29, 31, 33, 35-37
 ../lib/Tie/File/t/25_gen_nocache.......FAILED tests 3, 6, 9, 12, 15, 18, 21,
 24, 27, 30, 33, 36, 39, 42, 45, 48, 51, 54
 io/openpid..........................FAILED test 9
../lib/Net/Ping/t/510_ping_udp......FAILED test 2
../lib/Net/Ping/t/510_ping_udp......FAILED test 2
io/openpid..........................FAILED test 9

MSWin32     [stdio       ]-DDEBUGGING -DCCTYPE=GCC -DCCHOME=C:\MinGW
              (cont) -Dgcc_v3_2 -Duseithreads
    io/dup.................................FAILED tests 6-7

MSWin32     [perlio      ]-DDEBUGGING -DCCTYPE=GCC -DCCHOME=C:\MinGW
              (cont) -Dgcc_v3_2 -Duseithreads
    io/dup.................................FAILED tests 6-7
    io/openpid.............................FAILED test 9
    ../ext/threads/t/join..................dubious DIED. FAILED tests 5-12
    ../lib/Devel/SelfStubber...............FAILED tests 10-11
    ../lib/ExtUtils/t/Embed................FAILED tests 1-9
    ../lib/Net/Ping/t/450_service..........FAILED tests 8-10
    ../lib/Net/Ping/t/510_ping_udp.........FAILED test 2
    ../lib/Tie/File/t/09_gen_rs............FAILED tests 44-47
    ../lib/Tie/File/t/16_handle............FAILED tests 3, 5, 7, 9, 11, 13,
 15, 17, 19, 21, 23, 25, 27, 29, 31, 33, 35-37
 ../lib/Tie/File/t/25_gen_nocache.......FAILED tests 3, 6, 9, 12, 15, 18, 21,
 24, 27, 30, 33, 36, 39, 42, 45, 48, 51-52, 54
 io/openpid..........................FAILED test 9
../lib/Net/Ping/t/510_ping_udp......FAILED test 2
../lib/Net/Ping/t/510_ping_udp......FAILED test 2
../lib/Tie/File/t/16_handle.........FAILED test 3
io/openpid..........................FAILED test 9


Thread Next


nntp.perl.org: Perl Programming lists via nntp and http.
Comments to Ask Bjørn Hansen at ask@perl.org | Group listing | About