develooper Front page | perl.perl5.porters | Postings from April 2003

Smoke [5.9.0] 19201 FAIL(F) freebsd 5.0-release (i386/1 cpu)

From:
kane
Date:
April 14, 2003 04:39
Subject:
Smoke [5.9.0] 19201 FAIL(F) freebsd 5.0-release (i386/1 cpu)
Message ID:
200304141038.h3EAcZXa082764@smoke1.xs4all.nl
Automated smoke report for 5.9.0 patch 19201 on freebsd - 5.0-release (i386/1 cpu)
          v1.16_24      using cc version 3.2.1 [FreeBSD] 20021119 (release)
O = OK
F = Failure(s), extended report at the bottom
? = still running or test results not (yet) available
Build failures during:       - = unknown
    c = Configure, m = make, t = make test-prep

   19201     Configuration (common) none
------------ ----------------------------------------------------------------
O - O -      -Uuseperlio
O O O O
O O O O      -Duse64bitint
O O O O      -Duse64bitall
. . . .      -Duselongdouble
. . . .      -Dusemorebits
O O O O      -Duse64bitall -Duselongdouble
F F F F      -Duseithreads
F F F F      -Duseithreads -Duse64bitint
F F F F      -Duseithreads -Duse64bitall
F F F F      -Duseithreads -Duselongdouble
F F F F      -Duseithreads -Dusemorebits
F F F F      -Duseithreads -Duse64bitall -Duselongdouble
| | | +----- PERLIO = perlio -DDEBUGGING
| | +------- PERLIO = stdio  -DDEBUGGING
| +--------- PERLIO = perlio
+----------- PERLIO = stdio

Summary: FAIL(F)


Failures:

freebsd     [stdio       ]-Duseithreads
    ext/Encode/t/enc_module..............FAILED at test 1
    lib/ExtUtils/t/writemakefile_args....FAILED at test 3

freebsd     [perlio      ]-Duseithreads
    ext/Encode/t/enc_module..............FAILED at test 1
    lib/ExtUtils/t/Constant..............FAILED at test 3

freebsd     [stdio       ]-DDEBUGGING -Duseithreads
    ext/Encode/t/enc_module..............FAILED at test 1
    lib/ExtUtils/t/writemakefile_args....FAILED at test 3

freebsd     [perlio      ]-DDEBUGGING -Duseithreads
    ext/Encode/t/enc_module..............FAILED at test 1
    lib/ExtUtils/t/Constant..............FAILED at test 3

freebsd     [stdio       ]-Duseithreads -Duse64bitint
    ext/Encode/t/enc_module..............FAILED at test 1
    lib/ExtUtils/t/writemakefile_args....FAILED at test 3

freebsd     [perlio      ]-Duseithreads -Duse64bitint
    ext/Encode/t/enc_module..............FAILED at test 1
    lib/ExtUtils/t/Constant..............FAILED at test 3

freebsd     [stdio       ]-DDEBUGGING -Duseithreads -Duse64bitint
    ext/Encode/t/enc_module..............FAILED at test 1
    lib/ExtUtils/t/writemakefile_args....FAILED at test 3

freebsd     [perlio      ]-DDEBUGGING -Duseithreads -Duse64bitint
    ext/Encode/t/enc_module..............FAILED at test 1
    lib/ExtUtils/t/Constant..............FAILED at test 3

freebsd     [stdio       ]-Duseithreads -Duse64bitall
    ext/Encode/t/enc_module..............FAILED at test 1
    lib/ExtUtils/t/writemakefile_args....FAILED at test 3

freebsd     [perlio      ]-Duseithreads -Duse64bitall
    ext/Encode/t/enc_module..............FAILED at test 1
    lib/ExtUtils/t/Constant..............FAILED at test 3

freebsd     [stdio       ]-DDEBUGGING -Duseithreads -Duse64bitall
    ext/Encode/t/enc_module..............FAILED at test 1
    lib/ExtUtils/t/writemakefile_args....FAILED at test 3

freebsd     [perlio      ]-DDEBUGGING -Duseithreads -Duse64bitall
    ext/Encode/t/enc_module..............FAILED at test 1
    lib/ExtUtils/t/Constant..............FAILED at test 3

freebsd     [stdio       ]-Duseithreads -Duselongdouble
    ext/Encode/t/enc_module..............FAILED at test 1
    lib/ExtUtils/t/writemakefile_args....FAILED at test 3

freebsd     [perlio      ]-Duseithreads -Duselongdouble
    ext/Encode/t/enc_module..............FAILED at test 1
    lib/ExtUtils/t/Constant..............FAILED at test 3

freebsd     [stdio       ]-DDEBUGGING -Duseithreads -Duselongdouble
    ext/Encode/t/enc_module..............FAILED at test 1
    lib/ExtUtils/t/writemakefile_args....FAILED at test 3

freebsd     [perlio      ]-DDEBUGGING -Duseithreads -Duselongdouble
    ext/Encode/t/enc_module..............FAILED at test 1
    lib/ExtUtils/t/Constant..............FAILED at test 3

freebsd     [stdio       ]-Duseithreads -Dusemorebits
    ext/Encode/t/enc_module..............FAILED at test 1
    lib/ExtUtils/t/writemakefile_args....FAILED at test 3

freebsd     [perlio      ]-Duseithreads -Dusemorebits
    ext/Encode/t/enc_module..............FAILED at test 1
    lib/ExtUtils/t/Constant..............FAILED at test 3

freebsd     [stdio       ]-DDEBUGGING -Duseithreads -Dusemorebits
    ext/Encode/t/enc_module..............FAILED at test 1
    lib/ExtUtils/t/writemakefile_args....FAILED at test 3

freebsd     [perlio      ]-DDEBUGGING -Duseithreads -Dusemorebits
    ext/Encode/t/enc_module..............FAILED at test 1
    lib/ExtUtils/t/Constant..............FAILED at test 3

freebsd     [stdio       ]-Duseithreads -Duse64bitall -Duselongdouble
    ext/Encode/t/enc_module..............FAILED at test 1
    lib/ExtUtils/t/writemakefile_args....FAILED at test 3

freebsd     [perlio      ]-Duseithreads -Duse64bitall -Duselongdouble
    ext/Encode/t/enc_module..............FAILED at test 1
    lib/ExtUtils/t/Constant..............FAILED at test 3

freebsd     [stdio       ]-DDEBUGGING -Duseithreads -Duse64bitall
              (cont) -Duselongdouble
    ext/Encode/t/enc_module..............FAILED at test 1
    lib/ExtUtils/t/writemakefile_args....FAILED at test 3

freebsd     [perlio      ]-DDEBUGGING -Duseithreads -Duse64bitall
              (cont) -Duselongdouble
    ext/Encode/t/enc_module..............FAILED at test 1
    lib/ExtUtils/t/Constant..............FAILED at test 3




nntp.perl.org: Perl Programming lists via nntp and http.
Comments to Ask Bjørn Hansen at ask@perl.org | Group listing | About