develooper Front page | perl.perl5.porters | Postings from March 2003

Smoke [5.9.0] 18856 FAIL(F) bsdos 4.1 (i386/1 cpu)

Thread Next
From:
kane
Date:
March 12, 2003 04:52
Subject:
Smoke [5.9.0] 18856 FAIL(F) bsdos 4.1 (i386/1 cpu)
Message ID:
200303121252.h2CCqURm085497@smtpzilla1.xs4all.nl
Automated smoke report for 5.9.0 patch 18856 on bsdos - 4.1 (i386/1 cpu)
          v1.16_22      using cc version egcs-2.91.66 19990314 (egcs-1.1.2 release)
O = OK
F = Failure(s), extended report at the bottom
? = still running or test results not (yet) available
Build failures during:       - = unknown
    c = Configure, m = make, t = make test-prep

   18856     Configuration (common) none
------------ ----------------------------------------------------------------
F - F -      -Uuseperlio
F F F F
F F F F      -Duse64bitint
F F F F      -Duse64bitall
F F F F      -Duselongdouble
F F F F      -Dusemorebits
F F F F      -Duse64bitall -Duselongdouble
F F F F      -Duseithreads
F F F F      -Duseithreads -Duse64bitint
F F F F      -Duseithreads -Duse64bitall
F F F F      -Duseithreads -Duselongdouble
F F F F      -Duseithreads -Dusemorebits
F F F F      -Duseithreads -Duse64bitall -Duselongdouble
| | | +----- PERLIO = perlio -DDEBUGGING
| | +------- PERLIO = stdio  -DDEBUGGING
| +--------- PERLIO = perlio
+----------- PERLIO = stdio

Summary: FAIL(F)


Failures:

bsdos       [stdio       ]-Uuseperlio
bsdos       [stdio       ]-DDEBUGGING -Uuseperlio
    t/op/mkdir...........................FAILED at test 12

bsdos       [stdio/perlio]
bsdos       [stdio/perlio]-DDEBUGGING
    t/op/mkdir...........................FAILED at test 12

bsdos       [stdio/perlio]-Duse64bitint
bsdos       [stdio/perlio]-DDEBUGGING -Duse64bitint
bsdos       [stdio/perlio]-Duse64bitall
bsdos       [stdio/perlio]-DDEBUGGING -Duse64bitall
    t/op/int.............................FAILED at test 11
    t/op/mkdir...........................FAILED at test 12

bsdos       [stdio/perlio]-Duselongdouble
bsdos       [stdio/perlio]-DDEBUGGING -Duselongdouble
    t/op/mkdir...........................FAILED at test 12

bsdos       [stdio/perlio]-Dusemorebits
bsdos       [stdio/perlio]-DDEBUGGING -Dusemorebits
bsdos       [stdio/perlio]-Duse64bitall -Duselongdouble
bsdos       [stdio/perlio]-DDEBUGGING -Duse64bitall -Duselongdouble
    t/op/int.............................FAILED at test 11
    t/op/mkdir...........................FAILED at test 12

bsdos       [stdio/perlio]-Duseithreads
bsdos       [stdio/perlio]-DDEBUGGING -Duseithreads
    t/op/alarm...........................FAILED at test 3
    t/op/die_exit........................FAILED at test 8
    t/op/exec............................FAILED at test 17
    t/op/mkdir...........................FAILED at test 12
    t/op/taint...........................FAILED at test 73
    lib/English..........................FAILED at test 48
    lib/Test/Simple/t/More...............FAILED at test 41

bsdos       [stdio/perlio]-Duseithreads -Duse64bitint
bsdos       [stdio/perlio]-DDEBUGGING -Duseithreads -Duse64bitint
bsdos       [stdio/perlio]-Duseithreads -Duse64bitall
bsdos       [stdio       ]-DDEBUGGING -Duseithreads -Duse64bitall
    t/op/alarm...........................FAILED at test 3
    t/op/die_exit........................FAILED at test 8
    t/op/exec............................FAILED at test 17
    t/op/int.............................FAILED at test 11
    t/op/mkdir...........................FAILED at test 12
    t/op/taint...........................FAILED at test 73
    lib/English..........................FAILED at test 48
    lib/Test/Simple/t/More...............FAILED at test 41

bsdos       [perlio      ]-DDEBUGGING -Duseithreads -Duse64bitall
    t/op/die_exit........................FAILED at test 8
    t/op/exec............................FAILED at test 17
    t/op/int.............................FAILED at test 11
    t/op/mkdir...........................FAILED at test 12
    t/op/taint...........................FAILED at test 73
    lib/English..........................FAILED at test 48
    lib/Test/Simple/t/More...............FAILED at test 41

bsdos       [stdio/perlio]-Duseithreads -Duselongdouble
bsdos       [stdio/perlio]-DDEBUGGING -Duseithreads -Duselongdouble
    t/op/alarm...........................FAILED at test 3
    t/op/die_exit........................FAILED at test 8
    t/op/exec............................FAILED at test 17
    t/op/mkdir...........................FAILED at test 12
    t/op/taint...........................FAILED at test 73
    lib/English..........................FAILED at test 48
    lib/Test/Simple/t/More...............FAILED at test 41

bsdos       [stdio/perlio]-Duseithreads -Dusemorebits
bsdos       [stdio/perlio]-DDEBUGGING -Duseithreads -Dusemorebits
bsdos       [stdio/perlio]-Duseithreads -Duse64bitall -Duselongdouble
bsdos       [stdio/perlio]-DDEBUGGING -Duseithreads -Duse64bitall
              (cont) -Duselongdouble
    t/op/alarm...........................FAILED at test 3
    t/op/die_exit........................FAILED at test 8
    t/op/exec............................FAILED at test 17
    t/op/int.............................FAILED at test 11
    t/op/mkdir...........................FAILED at test 12
    t/op/taint...........................FAILED at test 73
    lib/English..........................FAILED at test 48
    lib/Test/Simple/t/More...............FAILED at test 41



Thread Next


nntp.perl.org: Perl Programming lists via nntp and http.
Comments to Ask Bjørn Hansen at ask@perl.org | Group listing | About