develooper Front page | perl.perl5.porters | Postings from September 2001

False OK's ?

Thread Next
From:
H . Merijn Brand
Date:
September 25, 2001 09:16
Subject:
False OK's ?
Message ID:
20010925173406.C5D0.H.M.BRAND@hccnet.nl
Browsing the log files again, I noticed that some tests fail in 'make test',
but succeed in harness, making it report 'All tests successful.', which is
translated to an 'O' in the smoke matrix.

--8<--- mktest.out 12185 HP-UX 11.00 HPc (no -DDEBUGGING)
Configuration: -Dusedevel -Duseperlio 
------------------------------------------------------------------------------
PERLIO = stdio	u=1.47  s=0.76  cu=109.96  cs=13.42  scripts=457  tests=26587
    ext/IO/lib/IO/t/io_xs..............FAILED at test 0

../ext/IO/lib/IO/t/io_xs....ok
All tests successful.
Files=1, Tests=4,  0 wallclock secs ( 0.08 cusr +  0.01 csys =  0.09 CPU)
PERLIO = perlio	u=1.53  s=0.73  cu=101.07  cs=13.24  scripts=457  tests=26587
    ext/IO/lib/IO/t/io_xs..............FAILED at test 0

../ext/IO/lib/IO/t/io_xs....ok
All tests successful.
Files=1, Tests=4,  1 wallclock secs ( 0.08 cusr +  0.01 csys =  0.09 CPU)
-->8---

--8<--- mktest.log
Configuration: -Dusedevel -Duseperlio 
------------------------------------------------------------------------------
Make distclean ...
Copy Policy.sh ...
Configure ...===== PROCURA Policy for hpux ========================
5.0072 <=> 5.006001

Make headers ...
Make ...
 Tests start here:
PERLIO = stdio
	ext/IO/lib/IO/t/io_xs..............FAILED at test 0
Failed 1 test script out of 457, 99.78% okay.
   ### Since not all tests were successful, you may want to run some
   ### of them individually and examine any diagnostic messages they
   ### produce.  See the INSTALL document's section on "make test".
   ### If you are testing the compiler, then ignore this message
   ### and run
   ###      ./perl harness
   ### in the directory ./t.
   ###
   ### Since most tests were successful, you have a good chance to
   ### get information with better granularity by running
   ###     ./perl harness
   ### in directory ./t.
u=1.47  s=0.76  cu=109.96  cs=13.42  scripts=457  tests=26587
make[2]: *** [_test_notty] Error 1
make[1]: *** [_test] Error 2
make: *** [test] Error 2

Extending failures with Harness

PERLIO = perlio
	ext/IO/lib/IO/t/io_xs..............FAILED at test 0
Failed 1 test script out of 457, 99.78% okay.
   ### Since not all tests were successful, you may want to run some
   ### of them individually and examine any diagnostic messages they
   ### produce.  See the INSTALL document's section on "make test".
   ### If you are testing the compiler, then ignore this message
   ### and run
   ###      ./perl harness
   ### in the directory ./t.
   ###
   ### Since most tests were successful, you have a good chance to
   ### get information with better granularity by running
   ###     ./perl harness
   ### in directory ./t.
u=1.53  s=0.73  cu=101.07  cs=13.24  scripts=457  tests=26587
make[2]: *** [_test_notty] Error 1
make[1]: *** [_test] Error 2
make: *** [test] Error 2

Extending failures with Harness
-->8---

-- 
H.Merijn Brand    Amsterdam Perl Mongers (http://www.amsterdam.pm.org/)
using perl-5.6.1, 5.7.1 & 629 on HP-UX 10.20 & 11.00, AIX 4.2, AIX 4.3,
  WinNT 4, Win2K pro & WinCE 2.11.  Smoking perl CORE: smokers@perl.org
http://archives.develooper.com/daily-build@perl.org/   perl-qa@perl.org
send smoke reports to: smokers-reports@perl.org, QA: http://qa.perl.org


Thread Next


nntp.perl.org: Perl Programming lists via nntp and http.
Comments to Ask Bjørn Hansen at ask@perl.org | Group listing | About