develooper Front page | perl.perl5.porters | Postings from August 2001

bleadperl on fire, Win95+4NT

Thread Next
From:
Michael G Schwern
Date:
August 17, 2001 12:55
Subject:
bleadperl on fire, Win95+4NT
Message ID:
20010817155513.Q1220@blackrider
Smoke reported forwarded on from smokers@perl.org.  Looks like a hot
time in Win32 tonite.


----- Forwarded message from Nikola Knezevic <indy@hemo.net> -----

Half-Automated smoke report for patch 11692
                        on MSWin32
Machine description: K5 W95,AMD K5,Win95,4NT,VC5 SP3;

O = OK
F = Failure(s), extended report at the bottom
? = still running or test results not (yet) available
/ = Not built
Build failures during:
     - = unknown, m = make, t = make test-prep

         Configuration
-------  --------------------------------------------------------------------
F F F F USE_PERLCRT=undef USE_MULTI=define USE_ITHREADS=define USE_IMP_SYS=define
F F F F USE_PERLCRT=define USE_MULTI=define USE_ITHREADS=define USE_IMP_SYS=define
| | | +- PERLIO = perlio CFG=DEBUG
| | +--- PERLIO = stdio  CFG=DEBUG
| +----- PERLIO = perlio
+------- PERLIO = stdio

Failures:

K5 W95,AMD K5,Win95,4NT,VC5 SP3: stdio            CFG=Debug USE_PERLCRT=undef USE_MULTI=define USE_ITHREADS=define USE_IMP_SYS=define
        comp/require...................FAILED tests 22-23
        io/fs..........................FAILED test 25
        io/open........................FAILED tests 4, 36
        io/tell........................FAILED tests 7, 10
        io/utf8........................FAILED test 19
        op/fork........................FAILED test 10
        op/magic.......................FAILED tests 1, 30
        ..\ext/Filter/t/call...........FAILED test 24
        ..\lib/ExtUtils................FAILED test 27
        ..\lib/Net/hostent.............dubious : Can't call method "addr" on an undefined value at line 34.
        ..\lib/Net/t/hostname..........FAILED test 1
        ..\lib/Search/Dict.............FAILED test 2
        ..\lib/Test/Simple/t/exit......FAILED tests 1-2, 4-5, 7, 9-10
        ..\lib/Tie/Handle/stdhandle....FAILED test 5
        ..\lib/Unicode/UCD.............FAILED tests 1-34, 52-118, 122-137

K5 W95,AMD K5,Win95,4NT,VC5 SP3: perlio           CFG=Debug USE_PERLCRT=undef USE_MULTI=define USE_ITHREADS=define USE_IMP_SYS=define
        base/term.......................FAILED test 2
        comp/multiline..................FAILED test 5
        io/fs...........................dubious : FAILED tests 21-29
        op/fork.........................FAILED tests 2, 10, 12
        op/magic........................dubious : FAILED tests 1, 19-41
        op/write........................FAILED tests 1-3, 6, 9-11
        run/exit........................FAILED test 3
        ..\ext/Cwd/Cwd..................FAILED tests 3-6
        ..\ext/XS/Typemap/Typemap.......FAILED tests 81-82
        ..\lib/ExtUtils.................FAILED test 27
        ..\lib/Memoize/t/expire_file....FAILED tests 11-12
        ..\lib/Net/hostent..............dubious 
        ..\lib/Net/t/hostname...........FAILED test 1
        ..\lib/Test/Simple/t/exit.......FAILED tests 1-2, 4-5, 7, 9-10
        ..\lib/warnings.................FAILED tests 382-384

K5 W95,AMD K5,Win95,4NT,VC5 SP3: stdio            CFG=Debug USE_PERLCRT=undef USE_MULTI=define USE_ITHREADS=define USE_IMP_SYS=define
        comp/require....................FAILED tests 22-23
        io/open.........................FAILED tests 4, 36
        io/tell.........................FAILED tests 7, 10
        io/utf8.........................FAILED test 19
        op/magic........................FAILED tests 1, 30
        op/fork.........................FAILED tests 10
        run/exit........................FAILED test 3
        ..\ext/Filter/t/call............FAILED test 24
        ..\lib/ExtUtils.................FAILED test 27
        ..\lib/Net/hostent..............dubious
        ..\lib/Net/t/hostname...........FAILED test 1 : System cannot find path : 'E:\dev\null'
        ..\lib/Search/Dict..............FAILED test 2
        ..\lib/Test/Simple/t/exit.......FAILED tests 1-2, 4-5, 7, 9-10
        ..\lib/Tie/Handle/stdhandle.....FAILED test 5
        ..\lib/Unicode/UCD..............FAILED tests 1-34, 52-118, 122-137

K5 W95,AMD K5,Win95,4NT,VC5 SP3: perlio           CFG=Debug USE_PERLCRT=undef USE_MULTI=define USE_ITHREADS=define USE_IMP_SYS=define
        base/term.......................FAILED test 2
        comp/multiline..................FAILED test 5
        io/fs...........................dubious : FAILED tests 21-29 : Can't cd back to E:\Perl_extra\workin_bleadperl\t
        op/fork.........................FAILED tests 10, 12
        op/magic........................dubious : FAILED tests 1, 19-41 : Dying on warning: print() on closed filehandle SCRIPT at op/magic.t line 165.
        op/write........................FAILED tests 1-3, 6, 9-11
        run/exit........................FAILED test 3
        ..\ext/Cwd/Cwd..................FAILED tests 3-6
        ..\ext/XS/Typemap/Typemap.......FAILED tests 81-82
        ..\lib/ExtUtils.................FAILED test 27
        ..\lib/Net/hostent..............dubious : FAILED tests 3, 5-7
        ..\lib/Net/t/hostname...........FAILED test 1 : System cannot find path : 'E:\dev\null'
        ..\lib/Test/Simple/t/exit.......FAILED tests 1-2, 4-5, 7, 9-10
        ..\lib/warnings.................FAILED tests 382-384

K5 W95,AMD K5,Win95,4NT,VC5 SP3: stdio            CFG=Debug USE_PERLCRT=define USE_MULTI=define USE_ITHREADS=define USE_IMP_SYS=define
        comp/require...................FAILED tests 22-23
        io/open........................FAILED tests 4, 36
        io/tell........................FAILED tests 7, 10
        io/fs.................................FAILED test 25
        io/utf8...............................FAILED test 19
        op/fork........................FAILED tests 10, 15
        op/magic.......................FAILED tests 1, 30
        run/exit........................FAILED test 3
        ..\ext/Filter/t/call..................FAILED test 24
        ..\lib/ExtUtils.......................FAILED test 27
        ..\lib/Net/hostent.............dubious
        ..\lib/Net/t/hostname...........FAILED test 1 : System cannot find path : 'E:\dev\null'
        ..\lib/Test/Simple/t/exit......FAILED tests 1-2, 4-5, 7, 9-10
        ..\lib/Tie/Handle/stdhandle...........FAILED test 5
        ..\lib/Search/Dict....................FAILED test 2
        ..\lib/Unicode/UCD.............FAILED tests 1-34, 52-118, 122-137

K5 W95,AMD K5,Win95,4NT,VC5 SP3: perlio           CFG=Debug USE_PERLCRT=define USE_MULTI=define USE_ITHREADS=define USE_IMP_SYS=define
        base/term.......................FAILED test 2
        comp/multiline..................FAILED test 5
        io/fs........................dubious
        op/fork......................FAILED tests 10, 12
        op/magic.....................dubious
        op/write.....................FAILED tests 1-3, 6, 9-11
        run/exit........................FAILED test 3
        ..\ext/Cwd/Cwd...............FAILED tests 3-6
        ..\ext/XS/Typemap/Typemap....FAILED tests 81-82
        ..\lib/ExtUtils.......................FAILED test 27
        ..\lib/Net/hostent...........dubious
        ..\lib/Net/t/hostname...........FAILED test 1 : System cannot find path : 'E:\dev\null'
        ..\lib/Test/Simple/t/exit....FAILED tests 1-2, 4-5, 7, 9-10
        ..\lib/warnings..............FAILED tests 382-384

K5 W95,AMD K5,Win95,4NT,VC5 SP3: stdio            CFG=Debug USE_PERLCRT=define USE_MULTI=define USE_ITHREADS=define USE_IMP_SYS=define
        comp/require...................FAILED tests 22-23
        io/open........................FAILED tests 4, 36
        io/tell........................FAILED tests 7, 10
        op/magic.......................FAILED tests 1, 30
        run/exit.......................FAILED test 3
        io/fs..........................FAILED test 25
        io/utf8........................FAILED test 19
        ..\lib/ExtUtils.......................FAILED test 27
        ..\lib/Net/hostent.............dubious
        ..\lib/Test/Simple/t/exit......FAILED tests 1-2, 4-5, 7, 9-10
        ..\lib/Search/Dict....................FAILED test 2
        ..\lib/Tie/Handle/stdhandle...........FAILED test 5
        ..\lib/Unicode/UCD.............FAILED tests 1-34, 52-118, 122-137

K5 W95,AMD K5,Win95,4NT,VC5 SP3: perlio           CFG=Debug USE_PERLCRT=define USE_MULTI=define USE_ITHREADS=define USE_IMP_SYS=define
        base/term.......................FAILED test 2
        comp/multiline..................FAILED test 5
        io/fs........................dubious
        op/fork......................FAILED tests 10, 12, 15
        op/magic.....................dubious
        op/write.....................FAILED tests 1-3, 6, 9-11
        run/exit........................FAILED test 3
        ..\ext/Cwd/Cwd...............FAILED tests 3-6
        ..\lib/ExtUtils.......................FAILED test 27
        ..\ext/XS/Typemap/Typemap....FAILED tests 81-82
        ..\lib/Net/t/hostname........FAILED test 1
        ..\lib/Net/hostent...........dubious
        ..\lib/Test/Simple/t/exit....FAILED tests 1-2, 4-5, 7, 9-10
        ..\lib/warnings..............FAILED tests 382-384

        
-- 
 .            `\!,        
 .            <. .>    
 [=======oOo==( ^ )==oOo========[ indy@hemo.net ]=======]      
 |---      _    -            --- [    member of    ]--- |        
 [========( )======_==============[ .counter attack. ]==]           
 .         ()     ( )
 .                ()




----- End forwarded message -----

-- 

Michael G. Schwern   <schwern@pobox.com>    http://www.pobox.com/~schwern/
Perl6 Quality Assurance     <perl-qa@perl.org>	     Kwalitee Is Job One
How can I stoop so low?  Years of practise, that's how. It's been hard
going but now I can stoop lower than a pygmy limbo dancer.
	-- BOFH

Thread Next


nntp.perl.org: Perl Programming lists via nntp and http.
Comments to Ask Bjørn Hansen at ask@perl.org | Group listing | About