develooper Front page | perl.perl5.porters | Postings from July 2001

Report /pro/3gl/CPAN/perl-current@11405

From:
H.M. Brand
Date:
July 19, 2001 05:15
Subject:
Report /pro/3gl/CPAN/perl-current@11405
Message ID:
20010719140502.E249.MERIJN@l1.procura.nl
The best way to accelerate a computer running Windows is at 9.8 m/s^2

Automated smoke report for patch 11405
                                                      |             cc           gcc
O = OK                                                | HP-UX 11.00 B.11.11.02   3.0             32-bit
F = Failure(s), extended report at the bottom         |                          2.9-hppa-000310 64-bit
? = still running or test results not (yet) available | HP-UX 10.20 A.10.32.30   2.8.1
Build failures during:       - = unknown              | AIX 4.3.3.0 vac 5.0.2.0  3.0
    c = Configure, m = make, t = make test-prep       | AIX 4.2.1.0 xlc 3.1.4.10 2.8.1

 HP-UX    HP-UX    HP-UX     AIX      AIX      AIX
 11.00    11.00    10.20     4.3      4.3      4.2
  HPc      gcc      HPc      vac      gcc      xlc
 11405    11405    11405    11405    11398    11405   Configuration
-------  -------  -------  -------  -------  -------  --------------------------------------------------------------------
F F F F  F F F F  F F F F  F F t t  F F F F  F F F F  -Uuseperlio
F F F F  F F F F  F F F F  F F t t  F F F F  F F F F  -Duseperlio
F F F F  F F F F  c c c c  F F t t  c c c c  c c c c  -Duseperlio -Duse64bitint
F F F F  F F F F  c c c c  F F t t  ? ? ? ?  c c c c  -Duseperlio -Duse64bitall
F F F F  c c c c  F F F F  F F t t  F F F F  F F F F  -Duseperlio -Duselongdouble
F F F F  c c c c  c c c c  F F t t  ? ? ? ?  c c c c  -Duseperlio -Dusemorebits
F F F F  F F F F  c c c c  F F t t  c c c c  c c c c  -Duseperlio -Duse64bitall -Duselongdouble
F F F F  F F F F  F F F F  F F F F  ? ? ? ?  F F F F  -Uuseperlio -Dusethreads -Duseithreads
F F F F  F F F F  F F F F  F F F F  ? ? ? ?  F F F F  -Duseperlio -Dusethreads -Duseithreads
F F F F  F F F F  c c c c  F F F F  ? ? ? ?  c c c c  -Duseperlio -Duse64bitint -Dusethreads -Duseithreads
F F F F  F F F F  c c c c  F F F F  ? ? ? ?  c c c c  -Duseperlio -Duse64bitall -Dusethreads -Duseithreads
F F F F  c c c c  F F F F  F F F F  ? ? ? ?  F F F F  -Duseperlio -Duselongdouble -Dusethreads -Duseithreads
F F F F  c c c c  c c c c  F F ? ?  ? ? ? ?  c c c c  -Duseperlio -Dusemorebits -Dusethreads -Duseithreads
F F F F  F F F F  c c c c  ? ? ? ?  ? ? ? ?  c c c c  -Duseperlio -Duse64bitall -Duselongdouble -Dusethreads -Duseithreads
| |                            | |
| +----- PERLIO = perlio       | +- PERLIO = perlio -DDEBUGGING
+------- PERLIO = stdio        +--- PERLIO = stdio  -DDEBUGGING

Failures:

HP-UX 11.00  stdio/perlio     -Uuseperlio
HP-UX 11.00  stdio/perlio     -DDEBUGGING -Uuseperlio
HP-UX 11.00  stdio/perlio     -Duseperlio
HP-UX 11.00  stdio/perlio     -DDEBUGGING -Duseperlio
HP-UX 11.00  stdio/perlio     -Duseperlio -Duse64bitint
HP-UX 11.00  stdio/perlio     -DDEBUGGING -Duseperlio -Duse64bitint
HP-UX 11.00  stdio/perlio     -Duseperlio -Duse64bitall
HP-UX 11.00  stdio/perlio     -DDEBUGGING -Duseperlio -Duse64bitall
HP-UX 11.00  stdio/perlio     -Duseperlio -Duselongdouble
HP-UX 11.00  stdio/perlio     -DDEBUGGING -Duseperlio -Duselongdouble
HP-UX 11.00  stdio/perlio     -Duseperlio -Dusemorebits
HP-UX 11.00  stdio/perlio     -DDEBUGGING -Duseperlio -Dusemorebits
HP-UX 11.00  stdio/perlio     -Duseperlio -Duse64bitall -Duselongdouble
HP-UX 11.00  stdio/perlio     -DDEBUGGING -Duseperlio -Duse64bitall -Duselongdouble
HP-UX 11.00  stdio/perlio     -Uuseperlio -Dusethreads -Duseithreads
HP-UX 11.00  stdio/perlio     -DDEBUGGING -Uuseperlio -Dusethreads -Duseithreads
HP-UX 11.00  stdio/perlio     -Duseperlio -Dusethreads -Duseithreads
HP-UX 11.00  stdio/perlio     -DDEBUGGING -Duseperlio -Dusethreads -Duseithreads
HP-UX 11.00  stdio/perlio     -Duseperlio -Duse64bitint -Dusethreads -Duseithreads
    lib/File/Find/find.................FAILED at test 189
    lib/File/Find/taint................FAILED at test 46

HP-UX 11.00  stdio/perlio     -DDEBUGGING -Duseperlio -Duse64bitint -Dusethreads -Duseithreads
    comp/bproto........................FAILED at test 0
    lib/File/Find/find.................FAILED at test 189
    lib/File/Find/taint................FAILED at test 46

HP-UX 11.00  stdio/perlio     -Duseperlio -Duse64bitall -Dusethreads -Duseithreads
    lib/File/Find/find.................FAILED at test 189
    lib/File/Find/taint................FAILED at test 46

HP-UX 11.00  stdio/perlio     -DDEBUGGING -Duseperlio -Duse64bitall -Dusethreads -Duseithreads
    comp/bproto........................FAILED at test 0
    lib/File/Find/find.................FAILED at test 189
    lib/File/Find/taint................FAILED at test 46

HP-UX 11.00  stdio/perlio     -Duseperlio -Duselongdouble -Dusethreads -Duseithreads
HP-UX 11.00  stdio/perlio     -DDEBUGGING -Duseperlio -Duselongdouble -Dusethreads -Duseithreads
HP-UX 11.00  stdio/perlio     -Duseperlio -Dusemorebits -Dusethreads -Duseithreads
    lib/File/Find/find.................FAILED at test 189
    lib/File/Find/taint................FAILED at test 46

HP-UX 11.00  stdio/perlio     -DDEBUGGING -Duseperlio -Dusemorebits -Dusethreads -Duseithreads
    comp/bproto........................FAILED at test 0
    lib/File/Find/find.................FAILED at test 189
    lib/File/Find/taint................FAILED at test 46

HP-UX 11.00  stdio/perlio     -Duseperlio -Duse64bitall -Duselongdouble -Dusethreads -Duseithreads
    lib/File/Find/find.................FAILED at test 189
    lib/File/Find/taint................FAILED at test 46

HP-UX 11.00  stdio/perlio     -DDEBUGGING -Duseperlio -Duse64bitall -Duselongdouble -Dusethreads -Duseithreads
    comp/bproto........................FAILED at test 0
    lib/File/Find/find.................FAILED at test 189
    lib/File/Find/taint................FAILED at test 46

HPUX 11 gcc  stdio/perlio     -Uuseperlio
HPUX 11 gcc  stdio/perlio     -DDEBUGGING -Uuseperlio
HPUX 11 gcc  stdio/perlio     -Duseperlio
HPUX 11 gcc  stdio/perlio     -DDEBUGGING -Duseperlio
    lib/File/Find/find.................FAILED at test 189
    lib/File/Find/taint................FAILED at test 46

HPUX 11 gcc  stdio/perlio     -Duseperlio -Duse64bitint
HPUX 11 gcc  stdio/perlio     -DDEBUGGING -Duseperlio -Duse64bitint
HPUX 11 gcc  stdio/perlio     -Duseperlio -Duse64bitall
HPUX 11 gcc  stdio/perlio     -DDEBUGGING -Duseperlio -Duse64bitall
HPUX 11 gcc  stdio/perlio     -Duseperlio -Duse64bitall -Duselongdouble
HPUX 11 gcc  stdio/perlio     -DDEBUGGING -Duseperlio -Duse64bitall -Duselongdouble
    ext/IO/lib/IO/t/io_multihomed......FAILED at test 3
    lib/File/Find/find.................FAILED at test 189
    lib/File/Find/taint................FAILED at test 46
    lib/Net/hostent....................FAILED at test 4

HPUX 11 gcc  stdio/perlio     -Uuseperlio -Dusethreads -Duseithreads
HPUX 11 gcc  stdio/perlio     -DDEBUGGING -Uuseperlio -Dusethreads -Duseithreads
HPUX 11 gcc  stdio/perlio     -Duseperlio -Dusethreads -Duseithreads
HPUX 11 gcc  stdio/perlio     -DDEBUGGING -Duseperlio -Dusethreads -Duseithreads
    lib/File/Find/find.................FAILED at test 189
    lib/File/Find/taint................FAILED at test 46

HPUX 11 gcc  stdio/perlio     -Duseperlio -Duse64bitint -Dusethreads -Duseithreads
HPUX 11 gcc  stdio/perlio     -DDEBUGGING -Duseperlio -Duse64bitint -Dusethreads -Duseithreads
HPUX 11 gcc  stdio/perlio     -Duseperlio -Duse64bitall -Dusethreads -Duseithreads
HPUX 11 gcc  stdio/perlio     -DDEBUGGING -Duseperlio -Duse64bitall -Dusethreads -Duseithreads
HPUX 11 gcc  stdio/perlio     -Duseperlio -Duse64bitall -Duselongdouble -Dusethreads -Duseithreads
HPUX 11 gcc  stdio/perlio     -DDEBUGGING -Duseperlio -Duse64bitall -Duselongdouble -Dusethreads -Duseithreads
    comp/bproto........................FAILED at test 0
    ext/IO/lib/IO/t/io_multihomed......FAILED at test 3
    lib/File/Find/find.................FAILED at test 189
    lib/File/Find/taint................FAILED at test 46
    lib/Net/hostent....................FAILED at test 4

HP-UX 10.20  stdio/perlio     -Uuseperlio
HP-UX 10.20  stdio/perlio     -DDEBUGGING -Uuseperlio
HP-UX 10.20  stdio/perlio     -Duseperlio
HP-UX 10.20  stdio/perlio     -DDEBUGGING -Duseperlio
HP-UX 10.20  stdio/perlio     -Duseperlio -Duselongdouble
HP-UX 10.20  stdio/perlio     -DDEBUGGING -Duseperlio -Duselongdouble
    lib/File/Find/find.................FAILED at test 189
    lib/File/Find/taint................FAILED at test 29

HP-UX 10.20  stdio/perlio     -Uuseperlio -Dusethreads -Duseithreads
HP-UX 10.20  stdio/perlio     -DDEBUGGING -Uuseperlio -Dusethreads -Duseithreads
    run/runenv.........................FAILED at test 1
    io/pipe............................FAILED at test 5
    op/fork............................FAILED at test 1
    ext/IO/lib/IO/t/io_multihomed......FAILED at test 2
    ext/IO/lib/IO/t/io_pipe............FAILED at test 1
    ext/IO/lib/IO/t/io_sock............FAILED at test 2
    ext/IO/lib/IO/t/io_unix............FAILED at test 2
    lib/File/Find/find.................FAILED at test 189
    lib/File/Find/taint................FAILED at test 29
    lib/FileHandle.....................FAILED at test 11
    lib/IPC/Open2......................FAILED at test 1
    lib/IPC/Open3......................FAILED at test 1

HP-UX 10.20  stdio/perlio     -Duseperlio -Dusethreads -Duseithreads
HP-UX 10.20  stdio/perlio     -DDEBUGGING -Duseperlio -Dusethreads -Duseithreads
HP-UX 10.20  stdio/perlio     -Duseperlio -Duselongdouble -Dusethreads -Duseithreads
HP-UX 10.20  stdio/perlio     -DDEBUGGING -Duseperlio -Duselongdouble -Dusethreads -Duseithreads
    run/runenv.........................FAILED at test 1
    io/fflush..........................FAILED at test 1
    io/pipe............................FAILED at test 5
    op/fork............................FAILED at test 1
    ext/IO/lib/IO/t/io_multihomed......FAILED at test 2
    ext/IO/lib/IO/t/io_pipe............FAILED at test 1
    ext/IO/lib/IO/t/io_sock............FAILED at test 2
    ext/IO/lib/IO/t/io_unix............FAILED at test 2
    lib/File/Find/find.................FAILED at test 189
    lib/File/Find/taint................FAILED at test 29
    lib/FileHandle.....................FAILED at test 11
    lib/IPC/Open2......................FAILED at test 1
    lib/IPC/Open3......................FAILED at test 1

AIX 4.3      stdio/perlio     -Uuseperlio
AIX 4.3      stdio/perlio     -Duseperlio
AIX 4.3      stdio/perlio     -Duseperlio -Duse64bitint
AIX 4.3      stdio/perlio     -Duseperlio -Duse64bitall
AIX 4.3      stdio/perlio     -Duseperlio -Duselongdouble
AIX 4.3      stdio/perlio     -Duseperlio -Dusemorebits
AIX 4.3      stdio/perlio     -Duseperlio -Duse64bitall -Duselongdouble
AIX 4.3      stdio/perlio     -Uuseperlio -Dusethreads -Duseithreads
AIX 4.3      stdio/perlio     -DDEBUGGING -Uuseperlio -Dusethreads -Duseithreads
AIX 4.3      stdio/perlio     -Duseperlio -Dusethreads -Duseithreads
AIX 4.3      stdio/perlio     -DDEBUGGING -Duseperlio -Dusethreads -Duseithreads
    lib/File/Find/find.................FAILED at test 189
    lib/File/Find/taint................FAILED at test 46

AIX 4.3      stdio/perlio     -Duseperlio -Duse64bitint -Dusethreads -Duseithreads
AIX 4.3      stdio/perlio     -DDEBUGGING -Duseperlio -Duse64bitint -Dusethreads -Duseithreads
AIX 4.3      stdio/perlio     -Duseperlio -Duse64bitall -Dusethreads -Duseithreads
AIX 4.3      stdio/perlio     -DDEBUGGING -Duseperlio -Duse64bitall -Dusethreads -Duseithreads
    ext/DB_File/t/db-btree.............FAILED at test 79
    lib/File/Find/find.................FAILED at test 189
    lib/File/Find/taint................FAILED at test 46

AIX 4.3      stdio/perlio     -Duseperlio -Duselongdouble -Dusethreads -Duseithreads
AIX 4.3      stdio/perlio     -DDEBUGGING -Duseperlio -Duselongdouble -Dusethreads -Duseithreads
    lib/File/Find/find.................FAILED at test 189
    lib/File/Find/taint................FAILED at test 46

AIX 4.3      stdio/perlio     -Duseperlio -Dusemorebits -Dusethreads -Duseithreads
    ext/DB_File/t/db-btree.............FAILED at test 79
    lib/File/Find/find.................FAILED at test 189
    lib/File/Find/taint................FAILED at test 46

AIX 4.3 gcc  stdio/perlio     -Uuseperlio
AIX 4.3 gcc  stdio/perlio     -DDEBUGGING -Uuseperlio
AIX 4.3 gcc  stdio/perlio     -Duseperlio
AIX 4.3 gcc  stdio/perlio     -DDEBUGGING -Duseperlio
AIX 4.3 gcc  stdio/perlio     -Duseperlio -Duselongdouble
AIX 4.3 gcc  stdio/perlio     -DDEBUGGING -Duseperlio -Duselongdouble
    lib/File/Find/find.................FAILED at test 189
    lib/File/Find/taint................FAILED at test 46

AIX 4.2      stdio/perlio     -Uuseperlio
AIX 4.2      stdio/perlio     -DDEBUGGING -Uuseperlio
AIX 4.2      stdio/perlio     -Duseperlio
AIX 4.2      stdio/perlio     -DDEBUGGING -Duseperlio
AIX 4.2      stdio/perlio     -Duseperlio -Duselongdouble
AIX 4.2      stdio/perlio     -DDEBUGGING -Duseperlio -Duselongdouble
AIX 4.2      stdio/perlio     -Uuseperlio -Dusethreads -Duseithreads
AIX 4.2      stdio/perlio     -DDEBUGGING -Uuseperlio -Dusethreads -Duseithreads
AIX 4.2      stdio/perlio     -Duseperlio -Dusethreads -Duseithreads
AIX 4.2      stdio/perlio     -DDEBUGGING -Duseperlio -Dusethreads -Duseithreads
AIX 4.2      stdio/perlio     -Duseperlio -Duselongdouble -Dusethreads -Duseithreads
AIX 4.2      stdio/perlio     -DDEBUGGING -Duseperlio -Duselongdouble -Dusethreads -Duseithreads
    lib/File/Find/find.................FAILED at test 189
    lib/File/Find/taint................FAILED at test 46




nntp.perl.org: Perl Programming lists via nntp and http.
Comments to Ask Bjørn Hansen at ask@perl.org | Group listing | About