develooper Front page | perl.perl5.porters | Postings from March 2001

9122 and sigaction/switch on HP-UX 11.00

Thread Next
From:
H . Merijn Brand
Date:
March 13, 2001 04:01
Subject:
9122 and sigaction/switch on HP-UX 11.00
Message ID:
20010313123716.BFD5.H.M.BRAND@hccnet.nl
since all 112 tests failed tonight cause of the ``awk typo in Configure, and
all systems were down the weekend :-(, I'm now smoking daytime (don't tell my
users)

9122 shows that sigaction tests are quite different for HP-UX 10.20 and 11.00
(Still smoking, so a lot of question marks for the tests not started yet or not
finished)

--8<---
Automated smoke report for patch 9122

O = OK
s = Skipped, cause tested in an earlier configuration
- = not tested, cause unable to build
F = Failure(s), extended report at the bottom
  left  letter for PERLIO = stdio,
  right letter for PERLIO = perlio

HP-UX HP-UX  AIX   AIX
11.00 10.20  4.3   4.2  Configuration
----- ----- ----- ----- --------------------------------------------------------------------
 F F   O O   O O   O O  -Uuseperlio
 F F   O O   O O   O ?  -Duseperlio
 F F   - -   O O   ? ?  -Duseperlio -Duse64bitint
 F F   - -   - -   ? ?  -Duseperlio -Duse64bitall
 s s   s s   ? ?   ? ?  -Duseperlio -Duselongdouble
 s s   s s   ? ?   ? ?  -Duseperlio -Dusemorebits
 s s   s s   ? ?   ? ?  -Duseperlio -Duse64bitall -Duselongdouble
 F F   ? ?   ? ?   ? ?  -Uuseperlio -Dusethreads -Duseithreads
 ? ?   ? ?   ? ?   ? ?  -Duseperlio -Dusethreads -Duseithreads

HP-UX 11.00  stdio    -Uuseperlio
    lib/sigaction.........FAILED at test 2

HP-UX 11.00  perlio   -Uuseperlio
    lib/sigaction.........FAILED at test 2

HP-UX 11.00  stdio    -Duseperlio
    lib/sigaction.........FAILED at test 2

HP-UX 11.00  perlio   -Duseperlio
    lib/sigaction.........FAILED at test 2

HP-UX 11.00  stdio    -Duseperlio -Duse64bitint
    lib/sigaction.........FAILED at test 2
    lib/switch............FAILED at test 205

HP-UX 11.00  perlio   -Duseperlio -Duse64bitint
    lib/sigaction.........FAILED at test 2
    lib/switch............FAILED at test 205

HP-UX 11.00  stdio    -Duseperlio -Duse64bitall
    lib/sigaction.........FAILED at test 2
    lib/switch............FAILED at test 205

HP-UX 11.00  perlio   -Duseperlio -Duse64bitall
    lib/sigaction.........FAILED at test 2
    lib/switch............FAILED at test 205

HP-UX 11.00  stdio    -Uuseperlio -Dusethreads -Duseithreads
    lib/sigaction.........FAILED at test 2

HP-UX 11.00  perlio   -Uuseperlio -Dusethreads -Duseithreads
    lib/sigaction.........FAILED at test 2
-->8---

-- 
H.Merijn Brand           Amsterdam Perl Mongers (http://www.amsterdam.pm.org/)
using perl-5.005.03, 5.6.0, 5.6.1, 5.7.1 & 623 on HP-UX 10.20 & 11.00, AIX 4.2
   AIX 4.3, WinNT 4, Win2K pro & WinCE 2.11 often with Tk800.022 &/| DBD-Unify
ftp://ftp.funet.fi/pub/languages/perl/CPAN/authors/id/H/HM/HMBRAND/


Thread Next


nntp.perl.org: Perl Programming lists via nntp and http.
Comments to Ask Bjørn Hansen at ask@perl.org | Group listing | About