develooper Front page | perl.mvs | Postings from April 2018

Smoke [blead] v5.27.10-119-g5f6af817ad FAIL(XM) os/390 25.00 (2964/)

Thread Next
From:
Yaroslav Kuzmin
Date:
April 12, 2018 09:51
Subject:
Smoke [blead] v5.27.10-119-g5f6af817ad FAIL(XM) os/390 25.00 (2964/)
Message ID:
1523526667.2865.5.camel@rocketsoftware.com

Smoke log available at https://drive.google.com/file/d/1XHUAwq74zUMfS3Ps3WnMAvpSagcXFWxJ

Automated smoke report for branch blead 5.27.11 patch 5f6af817add6d2df3603e0e94b6eb27ba5fb3970 v5.27.10-119-g5f6af817ad
RS12: 2964 (2964/)
    on        os/390 - 25.00
    using     c99 version
    smoketime 2 hours (average 1 hour)

Summary: FAIL(XM)

O = OK  F = Failure(s), extended report at the bottom
X = Failure(s) under TEST but not under harness
? = still running or test results not (yet) available
Build failures during:       - = unknown or N/A
c = Configure, m = make, M = make (after miniperl), t = make test-prep

v5.27.10-119-g5f6af817ad  Configuration (common) none
----------- ---------------------------------------------------------
X X M -     -Dusedl
>
> >
> > >
> > > +----- PERLIO = perlio -DDEBUGGING
> > +------- PERLIO = stdio  -DDEBUGGING
> +--------- PERLIO = perlio
+----------- PERLIO = stdio


Locally applied patches:
    SMOKE5f6af817add6d2df3603e0e94b6eb27ba5fb3970

Tests skipped on user request:
    # One test name on a line
Failures: (common-args) none
[stdio] -Dusedl
Inconsistent test results (between TEST and harness):
    ../t/re/pat_re_eval.t................... .............................................. FAILED at test 133
    ../t/uni/tr_utf8.t...................... ................................................. FAILED at test 3
    ../t/op/utfhash.t....................... .................................................. FAILED at test 28
    ../t/uni/bless.t........................ ................................................... FAILED--expected 84 tests, saw 80
    ../lib/feature/unicode_strings.t........ ................................... FAILED at test 4097
    ../t/mro/basic_01_c3_utf8.t............. ........................................ FAILED--expected 4 tests, saw 3
    ../lib/bytes.t.......................... ..................................................... FAILED at test 1
    ../t/mro/isarev_utf8.t.................. ............................................. FAILED at test 1
    ../lib/Unicode/UCD.t.................... ............................................... FAILED at test 170
    ../ext/XS-APItest/t/gv_autoload4.t...... ................................. FAILED at test 21
    ../t/re/uniprops05.t.................... ............................................... FAILED at test 19
    ../t/dist/Safe/t/safeutf8.t............. .......................................... FAILED at test 2
    ../t/re/regexp_unicode_prop.t........... ...................................... FAILED at test 94
    ../t/dist/Carp/t/arg_string.t........... ........................................ FAILED at test 11
    ../t/dist/Data-Dumper/t/dumper.t........ ..................................... FAILED at test 199
    ../t/re/uniprops06.t.................... ............................................... FAILED at test 57
    ../ext/XS-APItest/t/utf16_to_utf8.t..... ................................ FAILED at test 5
    ../t/dist/Unicode-Normalize/t/partial1.t ............................. FAILED at test 2
    ../ext/XS-APItest/t/handy00.t........... ...................................... FAILED at test 140763
    ../t/re/regexp_qr_embed.t............... .......................................... FAILED at test 1086
    ../t/mro/next_inanon_utf8.t............. ........................................ FAILED at test 1
    ../lib/utf8.t........................... ...................................................... FAILED at test 15
    ../t/op/ver.t........................... ...................................................... FAILED at test 14
    ../t/dist/Storable/t/regexp.t........... ........................................ FAILED at test 43
    ../t/dist/Unicode-Normalize/t/norm.t.... ................................. FAILED at test 18
    ../t/op/fresh_perl_utf8.t............... .......................................... FAILED at test 1
    ../t/op/utf8cache.t..................... ................................................ FAILED at test 4
    ../t/dist/Carp/t/arg_regexp.t........... ........................................ FAILED at test 11
    ../t/dist/Unicode-Normalize/t/illegal.t. .............................. FAILED at test 2
    ../t/re/uniprops02.t.................... ............................................... FAILED at test 1418
    ../t/re/uniprops10.t.................... ............................................... FAILED at test 13
    ../t/dist/Unicode-Normalize/t/fcdc.t.... ................................. FAILED at test 20
    ../t/uni/lex_utf8.t..................... ................................................ FAILED at test 1
    ../t/re/reg_fold.t...................... ................................................. FAILED at test 4
    ../t/dist/IO/t/io_utf8argv.t............ ......................................... FAILED at test 1
    ../ext/B/t/b.t.......................... ..................................................... FAILED at test 151
    ../t/dist/Unicode-Normalize/t/partial2.t ............................. FAILED at test 2
    ../t/uni/lower.t........................ ................................................... FAILED--no leader found
    ../t/op/split_unicode.t................. ............................................ FAILED at test 37
    ../t/uni/labels.t....................... .................................................. FAILED at test 4
    ../t/re/regexp_qr.t..................... ................................................ FAILED at test 1086
    ../t/dist/Unicode-Normalize/t/form.t.... ................................. FAILED at test 2
    ../t/op/ord.t........................... ...................................................... FAILED at test 2
    ../lib/strict.t......................... .................................................... FAILED at test 37
    ../t/re/regexp_noamp.t.................. ............................................. FAILED at test 1086
    ../t/mro/basic_01_dfs_utf8.t............ ....................................... FAILED--expected 4 tests, saw 3
    ../t/re/overload.t...................... ................................................. FAILED at test 82
    ../t/opbasic/concat.t................... .............................................. FAILED at test 4
    ../t/uni/opcroak.t...................... ................................................. FAILED at test 4
    ../t/uni/package.t...................... ................................................. FAILED at test 3
    ../t/re/subst.t......................... .................................................... FAILED at test 113
    ../t/op/lexsub.t........................ ................................................... FAILED at test 75
    ../t/uni/readline.t..................... ................................................ FAILED at test 6
    ../t/uni/sprintf.t...................... ................................................. FAILED at test 21
    ../lib/locale.t......................... .................................................... FAILED at test 113
    ../t/re/uniprops07.t.................... ............................................... FAILED at test 13
    ../t/run/switchC.t...................... ................................................. FAILED at test 3
    ../t/dist/ExtUtils-CBuilder/t/04-base.t. .............................. FAILED at test 46
    ../t/op/split.t......................... .................................................... FAILED at test 54
    ../ext/Devel-Peek/t/Peek.t.............. ......................................... FAILED at test 35
    ../lib/charnames.t...................... ................................................. FAILED at test 37
    ../ext/XS-APItest/t/gv_fetchmeth_autoload.t ........................ FAILED at test 36
    ../t/re/pat.t........................... ...................................................... FAILED at test 351
    ../t/re/pat_rt_report.t................. ............................................ FAILED at test 15
    ../t/uni/parser.t....................... .................................................. FAILED at test 1
    ../t/mro/basic_utf8.t................... .............................................. FAILED at test 34
    ../lib/DBM_Filter/t/encode.t............ ....................................... FAILED at test 14
    ../t/uni/write.t........................ ................................................... FAILED at test 7
    ../lib/warnings.t....................... .................................................. FAILED at test 55
    ../t/re/regex_sets.t.................... ............................................... FAILED at test 46
    ../t/re/regex_sets_compat.t............. ........................................ FAILED at test 1444
    ../t/dist/Storable/t/downgrade.t........ ..................................... FAILED at test 148
    ../ext/XS-APItest/t/labelconst.t........ ................................... FAILED at test 20
    ../lib/overload.t....................... .................................................. FAILED at test 5079
    ../t/re/uniprops08.t.................... ............................................... FAILED at test 1
    ../ext/XS-APItest/t/utf8.t.............. ......................................... FAILED at test 3218
    ../t/dist/Unicode-Normalize/t/func.t.... ................................. FAILED at test 76
    ../t/op/sprintf.t....................... .................................................. FAILED at test 151
    ../lib/open.t........................... ...................................................... FAILED at test 10
    ../t/uni/gv.t........................... ...................................................... FAILED at test 9
    ../t/uni/title.t........................ ................................................... FAILED--no leader found
    ../t/dist/IO/t/io_sock.t................ ............................................. FAILED at test 21
    ../t/re/uniprops03.t.................... ............................................... FAILED at test 1101
    ../t/re/fold_grind.t.................... ............................................... FAILED--no leader found
    ../t/op/bop.t........................... ...................................................... FAILED at test 225
    ../t/op/pack.t.......................... ..................................................... FAILED at test 588
    ../t/mro/next_ineval_utf8.t............. ........................................ FAILED at test 1
    ../ext/XS-APItest/t/gv_fetchmeth.t...... ................................. FAILED at test 26
    ../lib/B/Deparse.t...................... ................................................. FAILED at test 3
    ../ext/XS-APItest/t/hash.t.............. ......................................... FAILED at test 961
    ../t/re/uniprops09.t.................... ............................................... FAILED at test 9
    ../t/re/pat_advanced.t.................. ............................................. FAILED at test 31
    ../t/uni/select.t....................... .................................................. FAILED at test 2
    ../t/re/regexp_notrie.t................. ............................................ FAILED at test 1086
    ../ext/XS-APItest/t/swaplabel.t......... .................................... FAILED at test 30
    ../t/re/substT.t........................ ................................................... FAILED at test 113
    ../t/dist/Unicode-Normalize/t/split.t... ................................ FAILED at test 8
    ../t/uni/variables.t.................... ............................................... FAILED at test 1011
    ../t/re/reg_mesg.t...................... ................................................. FAILED at test 302
    ../t/op/lex.t........................... ...................................................... FAILED at test 25
    ../t/uni/upper.t........................ ................................................... FAILED at test 1
    ../t/uni/goto.t......................... .................................................... FAILED--expected 4 tests, saw 1
    ../t/lib/croak.t........................ ................................................... FAILED at test 91
    ../ext/XS-APItest/t/utf8_warn00.t....... .................................. FAILED at test 15
    ../t/mro/pkg_gen_utf8.t................. ............................................ FAILED at test 6
    ../t/re/reg_posixcc.t................... .............................................. FAILED at test 131
    ../ext/XS-APItest/t/svcat.t............. ........................................ FAILED at test 2
    ../t/uni/attrs.t........................ ................................................... FAILED at test 2
    ../t/dist/Storable/t/code.t............. .......................................... FAILED at test 62
    ../ext/XS-APItest/t/gv_fetchmethod_flags.t ......................... FAILED at test 10
    ../t/re/uniprops01.t.................... ............................................... FAILED at test 2
    ../t/mro/package_aliases_utf8.t......... .................................... FAILED at test 5
    ../t/io/utf8.t.......................... ..................................................... FAILED at test 52
    ../t/dist/Unicode-Normalize/t/test.t.... ................................. FAILED at test 10
    ../t/op/tr.t............................ ....................................................... FAILED at test 48
    ../t/uni/caller.t....................... .................................................. FAILED at test 1
    ../t/op/substr.t........................ ................................................... FAILED at test 376
    ../t/mro/next_skip_utf8.t............... .......................................... FAILED at test 6
    ../t/re/uniprops04.t.................... ............................................... FAILED at test 3368
    ../t/dist/Data-Dumper/t/bugs.t.......... ....................................... FAILED at test 9
    ../t/re/regexp_nonull.t................. ............................................ FAILED at test 1086
    ../ext/XS-APItest/t/svpeek.t............ ....................................... FAILED at test 42
    ../t/uni/method.t....................... .................................................. FAILED--expected 62 tests, saw 2
    ../t/dist/IO/t/io_utf8.t................ ............................................. FAILED at test 5
    ../t/dist/Unicode-Normalize/t/proto.t... ................................ FAILED at test 3
    ../t/uni/stash.t........................ ................................................... FAILED at test 10
    ../t/comp/utf.t......................... .................................................... FAILED at test 8
    ../t/re/subst_wamp.t.................... ............................................... FAILED at test 113
    ../t/uni/universal.t.................... ............................................... FAILED at test 2
    ../t/uni/fold.t......................... .................................................... FAILED at test 1
    ../t/re/regexp_trielist.t............... .......................................... FAILED at test 1086
    ../t/op/lc.t............................ ....................................................... FAILED at test 35
    ../t/re/regexp.t........................ ................................................... FAILED at test 1086
    ../t/re/script_run.t.................... ............................................... FAILED at test 40
    ../lib/feature.t........................ ................................................... FAILED at test 4
    ../t/io/open.t.......................... ..................................................... FAILED at test 51
    ../t/re/charset.t....................... .................................................. FAILED at test 1065
    ../lib/dumpvar.t........................ ................................................... FAILED at test 4
    ../t/mro/next_method_utf8.t............. ........................................ FAILED--expected 5 tests, saw 3
    ../t/dist/Data-Dumper/t/quotekeys.t..... .................................. FAILED at test 6
    ../t/re/alpha_assertions.t.............. ......................................... FAILED at test 2006

[perlio] -Dusedl
Inconsistent test results (between TEST and harness):
    ../lib/locale.t......................... .................................................... FAILED at test 113
    ../t/uni/sprintf.t...................... ................................................. FAILED at test 21
    ../t/uni/readline.t..................... ................................................ FAILED at test 6
    ../t/op/lexsub.t........................ ................................................... FAILED at test 75
    ../t/re/subst.t......................... .................................................... FAILED at test 113
    ../t/uni/package.t...................... ................................................. FAILED at test 3
    ../t/uni/opcroak.t...................... ................................................. FAILED at test 4
    ../t/opbasic/concat.t................... .............................................. FAILED at test 4
    ../t/re/overload.t...................... ................................................. FAILED at test 82
    ../t/mro/basic_01_dfs_utf8.t............ ....................................... FAILED--expected 4 tests, saw 3
    ../lib/strict.t......................... .................................................... FAILED at test 37
    ../t/re/regexp_noamp.t.................. ............................................. FAILED at test 1086
    ../t/op/ord.t........................... ...................................................... FAILED at test 2
    ../t/dist/Unicode-Normalize/t/form.t.... ................................. FAILED at test 2
    ../t/re/regexp_qr.t..................... ................................................ FAILED at test 1086
    ../t/op/split_unicode.t................. ............................................ FAILED at test 37
    ../t/uni/labels.t....................... .................................................. FAILED at test 4
    ../t/uni/lower.t........................ ................................................... FAILED--no leader found
    ../t/dist/Unicode-Normalize/t/partial2.t ............................. FAILED at test 2
    ../ext/B/t/b.t.......................... ..................................................... FAILED at test 151
    ../t/dist/IO/t/io_utf8argv.t............ ......................................... FAILED at test 1
    ../t/re/reg_fold.t...................... ................................................. FAILED at test 4
    ../t/uni/lex_utf8.t..................... ................................................ FAILED at test 1
    ../t/dist/Unicode-Normalize/t/fcdc.t.... ................................. FAILED at test 20
    ../t/re/uniprops10.t.................... ............................................... FAILED at test 13
    ../t/re/uniprops02.t.................... ............................................... FAILED at test 1418
    ../ext/XS-APItest/t/utf8.t.............. ......................................... FAILED at test 3218
    ../t/re/uniprops08.t.................... ............................................... FAILED at test 1
    ../lib/overload.t....................... .................................................. FAILED at test 5079
    ../ext/XS-APItest/t/labelconst.t........ ................................... FAILED at test 20
    ../t/dist/Storable/t/downgrade.t........ ..................................... FAILED at test 148
    ../t/re/regex_sets_compat.t............. ........................................ FAILED at test 1444
    ../lib/warnings.t....................... .................................................. FAILED at test 55
    ../t/re/regex_sets.t.................... ............................................... FAILED at test 46
    ../t/uni/write.t........................ ................................................... FAILED at test 7
    ../lib/DBM_Filter/t/encode.t............ ....................................... FAILED at test 14
    ../t/mro/basic_utf8.t................... .............................................. FAILED at test 34
    ../t/uni/parser.t....................... .................................................. FAILED at test 1
    ../t/re/pat.t........................... ...................................................... FAILED at test 351
    ../t/re/pat_rt_report.t................. ............................................ FAILED at test 15
    ../ext/XS-APItest/t/gv_fetchmeth_autoload.t ........................ FAILED at test 36
    ../lib/charnames.t...................... ................................................. FAILED at test 37
    ../ext/Devel-Peek/t/Peek.t.............. ......................................... FAILED at test 35
    ../t/op/split.t......................... .................................................... FAILED at test 54
    ../t/dist/ExtUtils-CBuilder/t/04-base.t. .............................. FAILED at test 46
    ../t/run/switchC.t...................... ................................................. FAILED at test 3
    ../t/re/uniprops07.t.................... ............................................... FAILED at test 13
    ../t/re/uniprops05.t.................... ............................................... FAILED at test 19
    ../ext/XS-APItest/t/gv_autoload4.t...... ................................. FAILED at test 21
    ../lib/Unicode/UCD.t.................... ............................................... FAILED at test 170
    ../t/mro/isarev_utf8.t.................. ............................................. FAILED at test 1
    ../lib/bytes.t.......................... ..................................................... FAILED at test 1
    ../t/mro/basic_01_c3_utf8.t............. ........................................ FAILED--expected 4 tests, saw 3
    ../lib/feature/unicode_strings.t........ ................................... FAILED at test 4097
    ../t/uni/bless.t........................ ................................................... FAILED--expected 84 tests, saw 80
    ../t/op/utfhash.t....................... .................................................. FAILED at test 28
    ../t/uni/tr_utf8.t...................... ................................................. FAILED at test 3
    ../t/re/pat_re_eval.t................... .............................................. FAILED at test 133
    ../t/dist/Unicode-Normalize/t/illegal.t. .............................. FAILED at test 2
    ../t/dist/Carp/t/arg_regexp.t........... ........................................ FAILED at test 11
    ../t/op/utf8cache.t..................... ................................................ FAILED at test 4
    ../t/op/fresh_perl_utf8.t............... .......................................... FAILED at test 1
    ../t/dist/Unicode-Normalize/t/norm.t.... ................................. FAILED at test 18
    ../t/dist/Storable/t/regexp.t........... ........................................ FAILED at test 43
    ../t/op/ver.t........................... ...................................................... FAILED at test 14
    ../lib/utf8.t........................... ...................................................... FAILED at test 15
    ../t/mro/next_inanon_utf8.t............. ........................................ FAILED at test 1
    ../t/re/regexp_qr_embed.t............... .......................................... FAILED at test 1086
    ../ext/XS-APItest/t/handy00.t........... ...................................... FAILED at test 140763
    ../t/dist/Unicode-Normalize/t/partial1.t ............................. FAILED at test 2
    ../ext/XS-APItest/t/utf16_to_utf8.t..... ................................ FAILED at test 5
    ../t/re/uniprops06.t.................... ............................................... FAILED at test 57
    ../t/dist/Data-Dumper/t/dumper.t........ ..................................... FAILED at test 199
    ../t/dist/Carp/t/arg_string.t........... ........................................ FAILED at test 11
    ../t/re/regexp_unicode_prop.t........... ...................................... FAILED at test 94
    ../t/dist/Safe/t/safeutf8.t............. .......................................... FAILED at test 2
    ../t/dist/IO/t/io_utf8.t................ ............................................. FAILED at test 5
    ../ext/XS-APItest/t/svpeek.t............ ....................................... FAILED at test 42
    ../t/uni/method.t....................... .................................................. FAILED--expected 62 tests, saw 2
    ../t/re/regexp_nonull.t................. ............................................ FAILED at test 1086
    ../t/dist/Data-Dumper/t/bugs.t.......... ....................................... FAILED at test 9
    ../t/re/uniprops04.t.................... ............................................... FAILED at test 3368
    ../t/mro/next_skip_utf8.t............... .......................................... FAILED at test 6
    ../t/op/substr.t........................ ................................................... FAILED at test 376
    ../t/uni/caller.t....................... .................................................. FAILED at test 1
    ../t/op/tr.t............................ ....................................................... FAILED at test 48
    ../t/dist/Unicode-Normalize/t/test.t.... ................................. FAILED at test 10
    ../t/io/utf8.t.......................... ..................................................... FAILED at test 52
    ../t/re/uniprops01.t.................... ............................................... FAILED at test 2
    ../t/mro/package_aliases_utf8.t......... .................................... FAILED at test 5
    ../t/dist/Storable/t/code.t............. .......................................... FAILED at test 62
    ../ext/XS-APItest/t/gv_fetchmethod_flags.t ......................... FAILED at test 10
    ../t/uni/attrs.t........................ ................................................... FAILED at test 2
    ../t/re/alpha_assertions.t.............. ......................................... FAILED at test 2006
    ../t/mro/next_method_utf8.t............. ........................................ FAILED--expected 5 tests, saw 3
    ../t/dist/Data-Dumper/t/quotekeys.t..... .................................. FAILED at test 6
    ../lib/dumpvar.t........................ ................................................... FAILED at test 4
    ../t/re/charset.t....................... .................................................. FAILED at test 1065
    ../t/io/open.t.......................... ..................................................... FAILED at test 51
    ../lib/feature.t........................ ................................................... FAILED at test 4
    ../t/re/script_run.t.................... ............................................... FAILED at test 40
    ../t/re/regexp.t........................ ................................................... FAILED at test 1086
    ../t/op/lc.t............................ ....................................................... FAILED at test 35
    ../t/re/regexp_trielist.t............... .......................................... FAILED at test 1086
    ../t/uni/fold.t......................... .................................................... FAILED at test 1
    ../t/uni/universal.t.................... ............................................... FAILED at test 2
    ../t/re/subst_wamp.t.................... ............................................... FAILED at test 113
    ../t/comp/utf.t......................... .................................................... FAILED at test 8
    ../t/uni/stash.t........................ ................................................... FAILED at test 10
    ../t/dist/Unicode-Normalize/t/proto.t... ................................ FAILED at test 3
    ../t/re/regexp_notrie.t................. ............................................ FAILED at test 1086
    ../t/uni/select.t....................... .................................................. FAILED at test 2
    ../t/re/pat_advanced.t.................. ............................................. FAILED at test 31
    ../t/re/uniprops09.t.................... ............................................... FAILED at test 9
    ../ext/XS-APItest/t/hash.t.............. ......................................... FAILED at test 811
    ../lib/B/Deparse.t...................... ................................................. FAILED at test 3
    ../ext/XS-APItest/t/gv_fetchmeth.t...... ................................. FAILED at test 26
    ../t/mro/next_ineval_utf8.t............. ........................................ FAILED at test 1
    ../t/op/pack.t.......................... ..................................................... FAILED at test 588
    ../t/op/bop.t........................... ...................................................... FAILED at test 225
    ../t/re/fold_grind.t.................... ............................................... FAILED--no leader found
    ../t/re/uniprops03.t.................... ............................................... FAILED at test 1101
    ../t/dist/IO/t/io_sock.t................ ............................................. FAILED at test 21
    ../t/uni/title.t........................ ................................................... FAILED--no leader found
    ../t/uni/gv.t........................... ...................................................... FAILED at test 9
    ../lib/open.t........................... ...................................................... FAILED at test 10
    ../t/op/sprintf.t....................... .................................................. FAILED at test 151
    ../t/dist/Unicode-Normalize/t/func.t.... ................................. FAILED at test 76
    ../ext/XS-APItest/t/svcat.t............. ........................................ FAILED at test 2
    ../t/re/reg_posixcc.t................... .............................................. FAILED at test 131
    ../t/mro/pkg_gen_utf8.t................. ............................................ FAILED at test 6
    ../ext/XS-APItest/t/utf8_warn00.t....... .................................. FAILED at test 15
    ../t/lib/croak.t........................ ................................................... FAILED at test 91
    ../t/uni/goto.t......................... .................................................... FAILED--expected 4 tests, saw 1
    ../t/uni/upper.t........................ ................................................... FAILED at test 1
    ../t/op/lex.t........................... ...................................................... FAILED at test 25
    ../t/re/reg_mesg.t...................... ................................................. FAILED at test 302
    ../t/uni/variables.t.................... ............................................... FAILED at test 1011
    ../t/dist/Unicode-Normalize/t/split.t... ................................ FAILED at test 8
    ../t/re/substT.t........................ ................................................... FAILED at test 113
    ../ext/XS-APItest/t/swaplabel.t......... .................................... FAILED at test 30

Compiler messages(os390):



--
Report by Test::Smoke v1.6 running on perl 5.24.1
(Reporter v0.052 / Smoker v0.045)



--

Regards,

Yaroslav Kuzmin
Developer C/C++ ,z/OS , Linux
3 Zhukovskiy Street · Miass, Chelyabinsk region 456318 · Russia
Tel:  +7.922.2.38.33.38
Email: YKuzmin@rocketsoftware.com
Web: www.rocketsoftware.com

================================
Rocket Software, Inc. and subsidiaries ■ 77 Fourth Avenue, Waltham MA 02451 ■ Main Office Toll Free Number: +1 855.577.4323
Contact Customer Support: https://my.rocketsoftware.com/RocketCommunity/RCEmailSupport
Unsubscribe from Marketing Messages/Manage Your Subscription Preferences - http://www.rocketsoftware.com/manage-your-email-preferences
Privacy Policy - http://www.rocketsoftware.com/company/legal/privacy-policy
================================

This communication and any attachments may contain confidential information of Rocket Software, Inc. All unauthorized use, disclosure or distribution is prohibited. If you are not the intended recipient, please notify Rocket Software immediately and destroy all copies of this communication. Thank you.

Thread Next


nntp.perl.org: Perl Programming lists via nntp and http.
Comments to Ask Bjørn Hansen at ask@perl.org | Group listing | About