develooper Front page | perl.mvs | Postings from January 2018

Smoke [blead] v5.26.0-1972-g6661956a23 FAIL(X) os/390 25.00 (2964/)

From:
Yaroslav Kuzmin
Date:
January 18, 2018 06:04
Subject:
Smoke [blead] v5.26.0-1972-g6661956a23 FAIL(X) os/390 25.00 (2964/)
Message ID:
1516255466.30343.0.camel@rocketsoftware.com

Smoke logs available at https://drive.google.com/file/d/1VPu_YRKcBY1W3ghmkt4eZb2l5w8pJ3sj

Automated smoke report for branch blead 5.27.8 patch 6661956a23de82b41adc406200054293d6d7aded v5.26.0-1972-g6661956a23
RS12: 2964 (2964/)
    on        os/390 - 25.00
    using     c99 version
    smoketime 6 hours 2 minutes (average 3 hours 1 minute)

Summary: FAIL(X)

O = OK  F = Failure(s), extended report at the bottom
X = Failure(s) under TEST but not under harness
? = still running or test results not (yet) available
Build failures during:       - = unknown or N/A
c = Configure, m = make, M = make (after miniperl), t = make test-prep

v5.26.0-1972-g6661956a23  Configuration (common) none
----------- ---------------------------------------------------------
X X X X     -Dusedl
>
> >
> > >
> > > +----- PERLIO = perlio -DDEBUGGING
> > +------- PERLIO = stdio  -DDEBUGGING
> +--------- PERLIO = perlio
+----------- PERLIO = stdio


Locally applied patches:
    SMOKE6661956a23de82b41adc406200054293d6d7aded

Tests skipped on user request:
    # One test name on a line
Failures: (common-args) none
[stdio] -Dusedl
Inconsistent test results (between TEST and harness):
    ../t/porting/podcheck.t................. ............................................ FAILED--expected 1473 tests, saw 0
    ../lib/DBM_Filter/t/encode.t............ ....................................... FAILED at test 14
    ../t/dist/Devel-PPPort/t/mess.t......... ...................................... FAILED at test 53
    ../ext/I18N-Langinfo/t/Langinfo.t....... .................................. FAILED--expected 38 tests, saw 37
    ../t/dist/Data-Dumper/t/dumper.t........ ..................................... FAILED at test 451
    ../lib/locale.t......................... .................................................... FAILED--no leader found

[perlio] -Dusedl
Inconsistent test results (between TEST and harness):
    ../t/porting/podcheck.t................. ............................................ FAILED--expected 1473 tests, saw 0
    ../lib/DBM_Filter/t/encode.t............ ....................................... FAILED at test 14
    ../ext/I18N-Langinfo/t/Langinfo.t....... .................................. FAILED--expected 38 tests, saw 37
    ../t/dist/Devel-PPPort/t/mess.t......... ...................................... FAILED at test 53
    ../t/dist/Data-Dumper/t/dumper.t........ ..................................... FAILED at test 451
    ../lib/locale.t......................... .................................................... FAILED--no leader found

[stdio] -DDEBUGGING -Dusedl
Inconsistent test results (between TEST and harness):
    ../t/porting/podcheck.t................. ............................................ FAILED--expected 1473 tests, saw 0
    ../t/dist/Devel-PPPort/t/mess.t......... ...................................... FAILED at test 53
    ../ext/I18N-Langinfo/t/Langinfo.t....... .................................. FAILED--expected 38 tests, saw 37
    ../lib/DBM_Filter/t/encode.t............ ....................................... FAILED at test 14
    ../t/dist/Data-Dumper/t/dumper.t........ ..................................... FAILED at test 451
    ../lib/locale.t......................... .................................................... FAILED--no leader found

[perlio] -DDEBUGGING -Dusedl
Inconsistent test results (between TEST and harness):
    ../t/dist/Data-Dumper/t/dumper.t........ ..................................... FAILED at test 451
    ../lib/locale.t......................... .................................................... FAILED--no leader found
    ../t/porting/podcheck.t................. ............................................ FAILED--expected 1473 tests, saw 0
    ../lib/DBM_Filter/t/encode.t............ ....................................... FAILED at test 14
    ../ext/I18N-Langinfo/t/Langinfo.t....... .................................. FAILED--expected 38 tests, saw 37
    ../t/dist/Devel-PPPort/t/mess.t......... ...................................... FAILED at test 53

Compiler messages(os390):



--
Report by Test::Smoke v1.6 running on perl 5.24.1
(Reporter v0.052 / Smoker v0.045)

--

Regards,

Yaroslav Kuzmin
Developer C/C++ ,z/OS , Linux
3 Zhukovskiy Street · Miass, Chelyabinsk region 456318 · Russia
Tel:  +7.922.2.38.33.38
Email: YKuzmin@rocketsoftware.com
Web: www.rocketsoftware.com
================================
Rocket Software, Inc. and subsidiaries ■ 77 Fourth Avenue, Waltham MA 02451 ■ Main Office Toll Free Number: +1 855.577.4323
Contact Customer Support: https://my.rocketsoftware.com/RocketCommunity/RCEmailSupport
Unsubscribe from Marketing Messages/Manage Your Subscription Preferences - http://www.rocketsoftware.com/manage-your-email-preferences
Privacy Policy - http://www.rocketsoftware.com/company/legal/privacy-policy
================================

This communication and any attachments may contain confidential information of Rocket Software, Inc. All unauthorized use, disclosure or distribution is prohibited. If you are not the intended recipient, please notify Rocket Software immediately and destroy all copies of this communication. Thank you.



nntp.perl.org: Perl Programming lists via nntp and http.
Comments to Ask Bjørn Hansen at ask@perl.org | Group listing | About