develooper Front page | perl.mvs | Postings from December 2017

Smoke [blead] v5.26.0-1591-g56e48c1076 FAIL(XM) os/390 25.00 (2964/)

Thread Next
From:
Yaroslav Kuzmin
Date:
December 5, 2017 05:05
Subject:
Smoke [blead] v5.26.0-1591-g56e48c1076 FAIL(XM) os/390 25.00 (2964/)
Message ID:
1512450232.14051.1.camel@rocketsoftware.com

Smoke log available https://drive.google.com/file/d/1CwVed6EgFWm29hbiN50NsNEGZGYw7vkP

Automated smoke report for branch blead 5.27.7 patch 56e48c10762ae388167c2f2449eea8553b396093 v5.26.0-1591-g56e48c1076
RS12: 2964 (2964/)
    on        os/390 - 25.00
    using     c99 version
    smoketime 1 hour 56 minutes (average 58 minutes 11 seconds)

Summary: FAIL(XM)

O = OK  F = Failure(s), extended report at the bottom
X = Failure(s) under TEST but not under harness
? = still running or test results not (yet) available
Build failures during:       - = unknown or N/A
c = Configure, m = make, M = make (after miniperl), t = make test-prep

v5.26.0-1591-g56e48c1076  Configuration (common) none
----------- ---------------------------------------------------------
X X M -     -Dusedl
>
> >
> > >
> > > +----- PERLIO = perlio -DDEBUGGING
> > +------- PERLIO = stdio  -DDEBUGGING
> +--------- PERLIO = perlio
+----------- PERLIO = stdio


Locally applied patches:
    SMOKE56e48c10762ae388167c2f2449eea8553b396093

Tests skipped on user request:
    # One test name on a line
Failures: (common-args) none
[stdio] -Dusedl
Inconsistent test results (between TEST and harness):
    ../t/op/lc.t............................ ....................................................... FAILED--expected 1163 tests, saw 56
    ../lib/utf8.t........................... ...................................................... FAILED at test 305
    ../t/op/utftaint.t...................... ................................................. FAILED at test 12
    ../lib/DBM_Filter/t/encode.t............ ....................................... FAILED at test 14
    ../lib/B/Deparse-core.t................. ............................................ FAILED at test 26
    ../ext/XS-APItest/t/handy00.t........... ...................................... FAILED at test 132858
    ../t/uni/lex_utf8.t..................... ................................................ FAILED at test 6
    ../t/re/subst.t......................... .................................................... FAILED at test 135
    ../t/op/chop.t.......................... ..................................................... FAILED at test 60
    ../t/dist/Carp/t/arg_regexp.t........... ........................................ FAILED--expected 42 tests, saw 18
    ../t/re/pat_advanced.t.................. ............................................. FAILED at test 218
    ../t/uni/write.t........................ ................................................... FAILED at test 1
    ../t/re/pat_rt_report.t................. ............................................ FAILED at test 2467
    ../t/comp/parser_run.t.................. ............................................. FAILED at test 2
    ../lib/B/Deparse.t...................... ................................................. FAILED at test 18
    ../t/op/coreamp.t....................... .................................................. FAILED at test 96
    ../t/uni/attrs.t........................ ................................................... FAILED at test 2
    ../t/op/pack.t.......................... ..................................................... FAILED at test 14710
    ../t/uni/fold.t......................... .................................................... FAILED--non-zero wait status: 65280
    ../t/dist/Storable/t/code.t............. .......................................... FAILED--expected 63 tests, saw 0
    ../t/dist/Devel-PPPort/t/pv_tools.t..... .................................. FAILED at test 7
    ../ext/XS-APItest/t/gv_autoload4.t...... ................................. FAILED at test 23
    ../t/re/substT.t........................ ................................................... FAILED at test 135
    ../t/porting/podcheck.t................. ............................................ FAILED--expected 1472 tests, saw 0
    ../lib/feature/unicode_strings.t........ ................................... FAILED at test 3331
    ../t/op/exec.t.......................... ..................................................... FAILED at test 28
    ../t/re/pat_re_eval.t................... .............................................. FAILED--expected 497 tests, saw 140
    ../t/dist/Data-Dumper/t/dumper.t........ ..................................... FAILED at test 352
    ../t/op/split_unicode.t................. ............................................ FAILED at test 37
    ../t/op/write.t......................... .................................................... FAILED at test 176
    ../t/comp/utf.t......................... .................................................... FAILED at test 78
    ../t/dist/Carp/t/arg_string.t........... ........................................ FAILED--expected 33 tests, saw 14
    ../t/dist/Data-Dumper/t/bugs.t.......... ....................................... FAILED at test 18
    ../t/opbasic/concat.t................... .............................................. FAILED at test 35
    ../t/re/subst_wamp.t.................... ............................................... FAILED at test 135

[perlio] -Dusedl
Inconsistent test results (between TEST and harness):
    ../lib/utf8.t........................... ...................................................... FAILED at test 305
    ../t/op/lc.t............................ ....................................................... FAILED--expected 1163 tests, saw 56
    ../lib/DBM_Filter/t/encode.t............ ....................................... FAILED at test 14
    ../t/op/utftaint.t...................... ................................................. FAILED at test 4
    ../lib/B/Deparse-core.t................. ............................................ FAILED at test 26
    ../t/uni/lex_utf8.t..................... ................................................ FAILED at test 6
    ../ext/XS-APItest/t/handy00.t........... ...................................... FAILED at test 132916
    ../t/re/subst.t......................... .................................................... FAILED at test 135
    ../lib/charnames.t...................... ................................................. FAILED at test 39
    ../t/op/chop.t.......................... ..................................................... FAILED at test 60
    ../t/dist/Carp/t/arg_regexp.t........... ........................................ FAILED--expected 42 tests, saw 18
    ../t/uni/write.t........................ ................................................... FAILED at test 1
    ../t/re/pat_advanced.t.................. ............................................. FAILED at test 218
    ../lib/B/Deparse.t...................... ................................................. FAILED at test 32
    ../t/comp/parser_run.t.................. ............................................. FAILED at test 2
    ../t/re/pat_rt_report.t................. ............................................ FAILED at test 2467
    ../t/uni/attrs.t........................ ................................................... FAILED at test 2
    ../t/op/pack.t.......................... ..................................................... FAILED at test 14709
    ../t/uni/fold.t......................... .................................................... FAILED--non-zero wait status: 65280
    ../ext/XS-APItest/t/gv_autoload4.t...... ................................. FAILED at test 23
    ../t/dist/Devel-PPPort/t/pv_tools.t..... .................................. FAILED at test 7
    ../t/dist/Storable/t/code.t............. .......................................... FAILED--expected 63 tests, saw 0
    ../t/re/substT.t........................ ................................................... FAILED at test 135
    ../t/porting/podcheck.t................. ............................................ FAILED--expected 1472 tests, saw 0
    ../t/op/exec.t.......................... ..................................................... FAILED at test 28
    ../t/re/pat_re_eval.t................... .............................................. FAILED--expected 497 tests, saw 140
    ../lib/feature/unicode_strings.t........ ................................... FAILED at test 3331
    ../t/op/write.t......................... .................................................... FAILED at test 176
    ../t/op/split_unicode.t................. ............................................ FAILED at test 37
    ../t/dist/Data-Dumper/t/dumper.t........ ..................................... FAILED at test 352
    ../t/comp/utf.t......................... .................................................... FAILED at test 135
    ../t/dist/Carp/t/arg_string.t........... ........................................ FAILED--expected 33 tests, saw 14
    ../t/opbasic/concat.t................... .............................................. FAILED at test 35
    ../t/re/subst_wamp.t.................... ............................................... FAILED at test 135
    ../t/dist/Data-Dumper/t/bugs.t.......... ....................................... FAILED at test 18

Compiler messages(os390):



--
Report by Test::Smoke v1.6 running on perl 5.24.1
(Reporter v0.052 / Smoker v0.045)



--

Regards,

Yaroslav Kuzmin
Developer C/C++ ,z/OS , Linux
3 Zhukovskiy Street · Miass, Chelyabinsk region 456318 · Russia
Tel:  +7.922.2.38.33.38
Email: YKuzmin@rocketsoftware.com
Web: www.rocketsoftware.com

================================
Rocket Software, Inc. and subsidiaries ■ 77 Fourth Avenue, Waltham MA 02451 ■ Main Office Toll Free Number: +1 877.328.2932
Contact Customer Support: https://my.rocketsoftware.com/RocketCommunity/RCEmailSupport
Unsubscribe from Marketing Messages/Manage Your Subscription Preferences - http://www.rocketsoftware.com/manage-your-email-preferences
Privacy Policy - http://www.rocketsoftware.com/company/legal/privacy-policy
================================

This communication and any attachments may contain confidential information of Rocket Software, Inc. All unauthorized use, disclosure or distribution is prohibited. If you are not the intended recipient, please notify Rocket Software immediately and destroy all copies of this communication. Thank you.

Thread Next


nntp.perl.org: Perl Programming lists via nntp and http.
Comments to Ask Bjørn Hansen at ask@perl.org | Group listing | About