develooper Front page | perl.mvs | Postings from November 2017

Smoke [blead] v5.26.0-1409-g02d43d4fe5 FAIL(XM) os/390 25.00 (2964/)

From:
Yaroslav Kuzmin
Date:
November 16, 2017 12:09
Subject:
Smoke [blead] v5.26.0-1409-g02d43d4fe5 FAIL(XM) os/390 25.00 (2964/)
Message ID:
1510834158.25440.9.camel@rocketsoftware.com

Smoke log available at https://drive.google.com/file/d/1eoLfBgSasHxpsH3F0d6yPZMAcG_MbXCs

Automated smoke report for branch blead 5.27.6 patch 02d43d4fe5a9bc7f7f8b3759421a04c19d95ebf2 v5.26.0-1409-g02d43d4fe5
RS12: 2964 (2964/)
    on        os/390 - 25.00
    using     c99 version
    smoketime 1 hour 51 minutes (average 55 minutes 36 seconds)

Summary: FAIL(XM)

O = OK  F = Failure(s), extended report at the bottom
X = Failure(s) under TEST but not under harness
? = still running or test results not (yet) available
Build failures during:       - = unknown or N/A
c = Configure, m = make, M = make (after miniperl), t = make test-prep

v5.26.0-1409-g02d43d4fe5  Configuration (common) none
----------- ---------------------------------------------------------
X X M -     -Dusedl
>
> >
> > >
> > > +----- PERLIO = perlio -DDEBUGGING
> > +------- PERLIO = stdio  -DDEBUGGING
> +--------- PERLIO = perlio
+----------- PERLIO = stdio


Locally applied patches:
    SMOKE02d43d4fe5a9bc7f7f8b3759421a04c19d95ebf2

Tests skipped on user request:
    # One test name on a line
Failures: (common-args) none
[stdio] -Dusedl
Inconsistent test results (between TEST and harness):
    ../t/opbasic/concat.t................... .............................................. FAILED at test 35
    ../t/op/exec.t.......................... ..................................................... FAILED at test 28
    ../t/uni/write.t........................ ................................................... FAILED at test 1
    ../lib/utf8.t........................... ...................................................... FAILED at test 305
    ../t/re/pat_rt_report.t................. ............................................ FAILED at test 2467
    ../lib/locale.t......................... .................................................... FAILED--no leader found
    ../lib/B/Deparse-core.t................. ............................................ FAILED at test 26
    ../ext/XS-APItest/t/handy00.t........... ...................................... FAILED at test 64439
    ../t/uni/lex_utf8.t..................... ................................................ FAILED at test 6
    ../t/dist/Carp/t/arg_string.t........... ........................................ FAILED--expected 33 tests, saw 14
    ../t/dist/Data-Dumper/t/dumper.t........ ..................................... FAILED at test 352
    ../t/op/split_unicode.t................. ............................................ FAILED at test 37
    ../t/dist/Data-Dumper/t/bugs.t.......... ....................................... FAILED at test 18
    ../lib/DBM_Filter/t/encode.t............ ....................................... FAILED at test 14
    ../t/op/utftaint.t...................... ................................................. FAILED at test 12
    ../lib/B/Deparse.t...................... ................................................. FAILED at test 10
    ../t/re/subst.t......................... .................................................... FAILED at test 135
    ../t/uni/attrs.t........................ ................................................... FAILED at test 2
    ../ext/XS-APItest/t/gv_autoload4.t...... ................................. FAILED at test 23
    ../t/comp/utf.t......................... .................................................... FAILED at test 78
    ../t/re/pat_advanced.t.................. ............................................. FAILED at test 218
    ../t/porting/podcheck.t................. ............................................ FAILED--expected 1471 tests, saw 0
    ../t/dist/Devel-PPPort/t/pv_tools.t..... .................................. FAILED at test 7
    ../lib/feature/unicode_strings.t........ ................................... FAILED at test 3331
    ../t/op/write.t......................... .................................................... FAILED at test 176
    ../t/re/substT.t........................ ................................................... FAILED at test 135
    ../t/dist/Storable/t/code.t............. .......................................... FAILED--expected 63 tests, saw 0
    ../t/comp/parser_run.t.................. ............................................. FAILED at test 2
    ../t/re/subst_wamp.t.................... ............................................... FAILED at test 135
    ../t/op/chop.t.......................... ..................................................... FAILED at test 60
    ../t/op/pack.t.......................... ..................................................... FAILED at test 14710
    ../t/re/pat_re_eval.t................... .............................................. FAILED--expected 497 tests, saw 140
    ../t/op/lc.t............................ ....................................................... FAILED--expected 1163 tests, saw 56
    ../t/dist/Carp/t/arg_regexp.t........... ........................................ FAILED--expected 42 tests, saw 18
    ../t/uni/fold.t......................... .................................................... FAILED--non-zero wait status: 65280

[perlio] -Dusedl
Inconsistent test results (between TEST and harness):
    ../t/uni/attrs.t........................ ................................................... FAILED at test 2
    ../t/re/subst.t......................... .................................................... FAILED at test 135
    ../lib/B/Deparse.t...................... ................................................. FAILED at test 18
    ../t/comp/utf.t......................... .................................................... FAILED at test 135
    ../ext/XS-APItest/t/gv_autoload4.t...... ................................. FAILED at test 23
    ../t/op/utftaint.t...................... ................................................. FAILED at test 4
    ../lib/feature/unicode_strings.t........ ................................... FAILED at test 3329
    ../t/dist/Devel-PPPort/t/pv_tools.t..... .................................. FAILED at test 7
    ../t/op/write.t......................... .................................................... FAILED at test 176
    ../t/dist/Storable/t/code.t............. .......................................... FAILED--expected 63 tests, saw 0
    ../t/re/substT.t........................ ................................................... FAILED at test 135
    ../t/re/pat_advanced.t.................. ............................................. FAILED at test 218
    ../t/porting/podcheck.t................. ............................................ FAILED--expected 1471 tests, saw 0
    ../t/op/chop.t.......................... ..................................................... FAILED at test 60
    ../t/re/pat_re_eval.t................... .............................................. FAILED--expected 497 tests, saw 140
    ../t/dist/Data-Dumper/t/quotekeys.t..... .................................. FAILED at test 15
    ../t/op/pack.t.......................... ..................................................... FAILED at test 14709
    ../t/re/subst_wamp.t.................... ............................................... FAILED at test 135
    ../t/comp/parser_run.t.................. ............................................. FAILED at test 2
    ../t/dist/Carp/t/arg_regexp.t........... ........................................ FAILED--expected 42 tests, saw 18
    ../t/op/lc.t............................ ....................................................... FAILED--expected 1163 tests, saw 56
    ../t/uni/fold.t......................... .................................................... FAILED--non-zero wait status: 65280
    ../t/op/exec.t.......................... ..................................................... FAILED at test 28
    ../t/uni/write.t........................ ................................................... FAILED at test 1
    ../t/opbasic/concat.t................... .............................................. FAILED at test 35
    ../lib/utf8.t........................... ...................................................... FAILED at test 305
    ../t/re/pat_rt_report.t................. ............................................ FAILED at test 2467
    ../ext/Devel-Peek/t/Peek.t.............. ......................................... FAILED at test 129
    ../lib/B/Deparse-core.t................. ............................................ FAILED at test 26
    ../ext/XS-APItest/t/handy00.t........... ...................................... FAILED at test 13662
    ../t/dist/Data-Dumper/t/dumper.t........ ..................................... FAILED at test 352
    ../t/dist/Carp/t/arg_string.t........... ........................................ FAILED--expected 33 tests, saw 14
    ../lib/DBM_Filter/t/encode.t............ ....................................... FAILED at test 14
    ../t/op/split_unicode.t................. ............................................ FAILED at test 37
    ../t/dist/Data-Dumper/t/bugs.t.......... ....................................... FAILED at test 18
    ../t/uni/lex_utf8.t..................... ................................................ FAILED at test 6

Compiler messages(os390):



--
Report by Test::Smoke v1.6 running on perl 5.24.1
(Reporter v0.052 / Smoker v0.045)

--

Regards,

Yaroslav Kuzmin
Developer C/C++ ,z/OS , Linux
3 Zhukovskiy Street · Miass, Chelyabinsk region 456318 · Russia
Tel:  +7.922.2.38.33.38
Email: YKuzmin@rocketsoftware.com
Web: www.rocketsoftware.com


================================
Rocket Software, Inc. and subsidiaries ■ 77 Fourth Avenue, Waltham MA 02451 ■ Main Office Toll Free Number: +1 877.328.2932
Contact Customer Support: https://my.rocketsoftware.com/RocketCommunity/RCEmailSupport
Unsubscribe from Marketing Messages/Manage Your Subscription Preferences - http://www.rocketsoftware.com/manage-your-email-preferences
Privacy Policy - http://www.rocketsoftware.com/company/legal/privacy-policy
================================

This communication and any attachments may contain confidential information of Rocket Software, Inc. All unauthorized use, disclosure or distribution is prohibited. If you are not the intended recipient, please notify Rocket Software immediately and destroy all copies of this communication. Thank you.



nntp.perl.org: Perl Programming lists via nntp and http.
Comments to Ask Bjørn Hansen at ask@perl.org | Group listing | About