develooper Front page | perl.mvs | Postings from May 2017

Smoke [blead] v5.25.12-28-gb4972372a7 FAIL(X) os/390 25.00 (2964/)

From:
Yaroslav Kuzmin
Date:
May 10, 2017 06:01
Subject:
Smoke [blead] v5.25.12-28-gb4972372a7 FAIL(X) os/390 25.00 (2964/)
Message ID:
1494390462.23319.1.camel@rocketsoftware.com


Automated smoke report for branch blead 5.26.0 patch b4972372a75776de3c9e6bd234a398d103677316 v5.25.12-28-gb4972372a7
RS12: 2964 (2964/)
    on        os/390 - 25.00
    using     c99 version
    smoketime 15 hours 58 minutes (average 7 hours 59 minutes)

Summary: FAIL(X)

O = OK  F = Failure(s), extended report at the bottom
X = Failure(s) under TEST but not under harness
? = still running or test results not (yet) available
Build failures during:       - = unknown or N/A
c = Configure, m = make, M = make (after miniperl), t = make test-prep

v5.25.12-28-gb4972372a7  Configuration (common) none
----------- ---------------------------------------------------------
X X X X     -Dusedl
>
> >
> > >
> > > +----- PERLIO = perlio -DDEBUGGING
> > +------- PERLIO = stdio  -DDEBUGGING
> +--------- PERLIO = perlio
+----------- PERLIO = stdio


Locally applied patches:
    SMOKEb4972372a75776de3c9e6bd234a398d103677316

Tests skipped on user request:
    # One test name on a line
Failures: (common-args) none
[stdio] -Dusedl
Inconsistent test results (between TEST and harness):
    ../lib/DBM_Filter/t/encode.t............ ....................................... FAILED at test 14
    ../t/porting/podcheck.t................. ............................................ FAILED--expected 1447 tests, saw 0

[perlio] -Dusedl
[perlio] -DDEBUGGING -Dusedl
Inconsistent test results (between TEST and harness):
    ../t/porting/podcheck.t................. ............................................ FAILED--expected 1447 tests, saw 0
    ../lib/DBM_Filter/t/encode.t............ ....................................... FAILED at test 14

[stdio] -DDEBUGGING -Dusedl
Inconsistent test results (between TEST and harness):
    ../t/porting/podcheck.t................. ............................................ FAILED--expected 1447 tests, saw 0
    ../lib/DBM_Filter/t/encode.t............ ....................................... FAILED at test 14
    ../t/re/fold_grind.t.................... ............................................... FAILED--no leader found
    ../t/re/pat_psycho.t.................... ............................................... FAILED--expected 15 tests, saw 10

Compiler messages(os390):



--
Report by Test::Smoke v1.6 running on perl 5.22.0
(Reporter v0.052 / Smoker v0.045)

--

Regards,

Yaroslav Kuzmin
Developer C/C++ ,z/OS , Linux
3 Zhukovskiy Street · Miass, Chelyabinsk region 456318 · Russia
Tel:  +7.922.2.38.33.38
Email: YKuzmin@rocketsoftware.com
Web: www.rocketsoftware.com
Smoke log available at https://drive.google.com/file/d/0B5PTttxwo7qAR3ptZFZIbTZRTUE
================================
Rocket Software, Inc. and subsidiaries ■ 77 Fourth Avenue, Waltham MA 02451 ■ Main Office Toll Free Number: +1 877.328.2932
Contact Customer Support: https://my.rocketsoftware.com/RocketCommunity/RCEmailSupport
Unsubscribe from Marketing Messages/Manage Your Subscription Preferences - http://www.rocketsoftware.com/manage-your-email-preferences
Privacy Policy - http://www.rocketsoftware.com/company/legal/privacy-policy
================================

This communication and any attachments may contain confidential information of Rocket Software, Inc. All unauthorized use, disclosure or distribution is prohibited. If you are not the intended recipient, please notify Rocket Software immediately and destroy all copies of this communication. Thank you.



nntp.perl.org: Perl Programming lists via nntp and http.
Comments to Ask Bjørn Hansen at ask@perl.org | Group listing | About