develooper Front page | perl.libwww | Postings from April 2003

make test failures, second try...

Thread Previous | Thread Next
From:
Mattias.Borell
Date:
April 1, 2003 02:49
Subject:
make test failures, second try...
Message ID:
200304011047.h31AldjR002581@hactar.lub.lu.se
No answers to this one last time, and I haven't solved it myself... :-[

Any ideas are welcome.

solaris 7
perl 5.8.0
lwp 5.69

user@host(12:30:10)@ make test
/usr/local/bin/perl5.8.0 t/TEST 0
base/common-req.......ok                                                     
base/cookies..........ok                                                     
base/date.............ok                                                     
base/headers-auth.....ok                                                     
base/headers-etag.....ok                                                     
base/headers-util.....ok                                                     
base/headers..........ok                                                     
base/http.............ok                                                     
base/listing..........ok                                                     
base/mediatypes.......ok                                                     
base/message..........ok                                                     
base/negotiate........ok                                                     
base/response.........ok                                                     
base/status...........ok                                                     
base/ua...............ok                                                     
html/form.............ok                                                     
robot/rules-dbm.......ok                                                     
robot/rules...........ok                                                     
robot/ua-get..........Can't modify subroutine entry in scalar assignment at /usr/local/lib/perl5/5.8.0/Exporter.pm line 9, near "0;"
BEGIN failed--compilation aborted at /usr/local/lib/perl5/5.8.0/sun4-solaris/Config.pm line 2.
BEGIN failed--compilation aborted at robot/ua.t line 39.
Missing base argument at robot/ua-get.t line 55
robot/ua-get..........dubious                                                
        Test returned status 255 (wstat 65280, 0xff00)
DIED. FAILED tests 1-7
        Failed 7/7 tests, 0.00% okay
robot/ua..............Can't modify subroutine entry in scalar assignment at /usr/local/lib/perl5/5.8.0/Exporter.pm line 9, near "0;"
BEGIN failed--compilation aborted at /usr/local/lib/perl5/5.8.0/sun4-solaris/Config.pm line 2.
BEGIN failed--compilation aborted at robot/ua.t line 39.
Missing base argument at robot/ua.t line 55
robot/ua..............dubious                                                
        Test returned status 255 (wstat 65280, 0xff00)
DIED. FAILED tests 1-7
        Failed 7/7 tests, 0.00% okay
local/autoload-get....ok                                                     
local/autoload........ok                                                     
local/get.............ok                                                     
local/http-get........Can't modify subroutine entry in scalar assignment at /usr/local/lib/perl5/5.8.0/Exporter.pm line 9, near "0;"
BEGIN failed--compilation aborted at /usr/local/lib/perl5/5.8.0/sun4-solaris/Config.pm line 2.
BEGIN failed--compilation aborted at local/http-get.t line 41.
Missing base argument at local/http-get.t line 57
local/http-get........dubious                                                
        Test returned status 255 (wstat 65280, 0xff00)
DIED. FAILED tests 1-19
        Failed 19/19 tests, 0.00% okay
local/http............Can't modify subroutine entry in scalar assignment at /usr/local/lib/perl5/5.8.0/Exporter.pm line 9, near "0;"
BEGIN failed--compilation aborted at /usr/local/lib/perl5/5.8.0/sun4-solaris/Config.pm line 2.
BEGIN failed--compilation aborted at local/http.t line 38.
Missing base argument at local/http.t line 54
local/http............dubious                                                
        Test returned status 255 (wstat 65280, 0xff00)
DIED. FAILED tests 1-18
        Failed 18/18 tests, 0.00% okay
local/protosub........ok                                                     
Failed Test      Stat Wstat Total Fail  Failed  List of Failed
-------------------------------------------------------------------------------
local/http-get.t  255 65280    19   19 100.00%  1-19
local/http.t      255 65280    18   18 100.00%  1-18
robot/ua-get.t    255 65280     7    7 100.00%  1-7
robot/ua.t        255 65280     7    7 100.00%  1-7
Failed 4/26 test scripts, 84.62% okay. 51/343 subtests failed, 85.13% okay.
make: *** [test] Error 2


user@host(12:45:17)@ perl5.8.0 -V
Summary of my perl5 (revision 5.0 version 8 subversion 0) configuration:
  Platform:
    osname=solaris, osvers=2.7, archname=sun4-solaris
    uname='sunos hostname 5.7 generic_106541-23 sun4u sparc '
    config_args=''
    hint=recommended, useposix=true, d_sigaction=define
    usethreads=undef use5005threads=undef useithreads=undef usemultiplicity=undef
    useperlio=define d_sfio=undef uselargefiles=define usesocks=undef
    use64bitint=undef use64bitall=undef uselongdouble=undef
    usemymalloc=n, bincompat5005=undef
  Compiler:
    cc='gcc', ccflags ='-fno-strict-aliasing -D_LARGEFILE_SOURCE -D_FILE_OFFSET_BITS=64 -I/usr/local/include',
    optimize='-O2',
    cppflags='-fno-strict-aliasing -I/usr/local/include'
    ccversion='', gccversion='3.2.2', gccosandvers='solaris2.7'
    intsize=4, longsize=4, ptrsize=4, doublesize=8, byteorder=4321
    d_longlong=define, longlongsize=8, d_longdbl=define, longdblsize=16
    ivtype='long', ivsize=4, nvtype='double', nvsize=8, Off_t='off_t', lseeksize=8
    alignbytes=8, prototype=define
  Linker and Libraries:
    ld='gcc', ldflags =' -L/usr/local/lib '
    libpth=/usr/local/lib /usr/lib /usr/ccs/lib
    libs=-lsocket -lnsl -lgdbm -ldl -lm -lc
    perllibs=-lsocket -lnsl -ldl -lm -lc
    libc=/lib/libc.so, so=so, useshrplib=false, libperl=libperl.a
    gnulibc_version=''
  Dynamic Linking:
    dlsrc=dl_dlopen.xs, dlext=so, d_dlsymun=undef, ccdlflags=' '
    cccdlflags='-fPIC', lddlflags='-G -L/usr/local/lib'


Characteristics of this binary (from libperl): 
  Compile-time options: USE_LARGE_FILES
  Built under solaris
  Compiled at Mar 18 2003 16:12:13
  @INC:
    /usr/local/lib/perl5/5.8.0/sun4-solaris
    /usr/local/lib/perl5/5.8.0
    /usr/local/lib/perl5/site_perl/5.8.0/sun4-solaris
    /usr/local/lib/perl5/site_perl/5.8.0
    /usr/local/lib/perl5/site_perl
    .



/Mattias

Thread Previous | Thread Next


nntp.perl.org: Perl Programming lists via nntp and http.
Comments to Ask Bjørn Hansen at ask@perl.org | Group listing | About