develooper Front page | perl.libwww | Postings from February 2003

Win2k build libwww 5.69 Failed 10/36 test scripts, 23/366 subtests failed

From:
Wenjie Wang
Date:
February 4, 2003 21:26
Subject:
Win2k build libwww 5.69 Failed 10/36 test scripts, 23/366 subtests failed
Message ID:
DEEEKFLKGPCNLFMBOBAOGEHHCAAA.williamw@aurema.com
Greetings,

I've just build libwww 5.69 on my win2k box with VC++6 with psdk and updated
sp installed.

Libwww 5.69 builds ok but filed the test script.  The situation is a bit
worst than what "Qing-Jie Zhou" has reported. btw, I using ActiveState Perl
v5.006001 MSWin32 and have to go through a proxy server to access internet.

Following is test dump:
----------------------------------------8<----------------------------------
-----
live/activestate....EOF instead of response status line at
../blib/lib/Net/HTTP/Methods.pm line 300.
live/activestate....dubious
        Test returned status 255 (wstat 65280, 0xff00)
DIED. FAILED tests 1-2
        Failed 2/2 tests, 0.00% okay
live/jigsaw-auth-b..FAILED tests 1-3
        Failed 3/3 tests, 0.00% okay
live/jigsaw-auth-d..FAILED test 1
        Failed 1/1 tests, 0.00% okay
live/jigsaw-chunk...Use of uninitialized value in string eq at
live/jigsaw-chunk.t line 14.
Can't read entity body: Unknown error   ...propagated at live/jigsaw-chunk.t
line 19.
live/jigsaw-chunk...dubious
        Test returned status 9 (wstat 2304, 0x900)
DIED. FAILED tests 1-5
        Failed 5/5 tests, 0.00% okay
live/jigsaw-md5-get.Use of uninitialized value in string eq at
live/jigsaw-md5-get.t line 14.
live/jigsaw-md5-get.FAILED tests 1-2
        Failed 2/2 tests, 0.00% okay
live/jigsaw-md5.....Use of uninitialized value in string eq at
live/jigsaw-md5.t line 14.
live/jigsaw-md5.....FAILED tests 1-2
        Failed 2/2 tests, 0.00% okay
live/jigsaw-neg-get.FAILED test 1
        Failed 1/1 tests, 0.00% okay
live/jigsaw-neg.....FAILED test 1
        Failed 1/1 tests, 0.00% okay
live/jigsaw-te......FAILED tests 1-4
        Failed 4/4 tests, 0.00% okay
live/validator......Can't call method "find_input" on an undefined value at
live/validator.t line 32.
live/validator......dubious
        Test returned status 2 (wstat 512, 0x200)
DIED. FAILED tests 1-2
        Failed 2/2 tests, 0.00% okay
Failed Test           Status Wstat Total Fail  Failed  List of Failed
----------------------------------------------------------------------------
----

live/activestate.t       255 65280     2    2 100.00%  1-2
live/jigsaw-auth-b.t                   3    3 100.00%  1-3
live/jigsaw-auth-d.t                   1    1 100.00%  1
live/jigsaw-chunk.t        9  2304     5    5 100.00%  1-5
live/jigsaw-md5-get.t                  2    2 100.00%  1-2
live/jigsaw-md5.t                      2    2 100.00%  1-2
live/jigsaw-neg-get.t                  1    1 100.00%  1
live/jigsaw-neg.t                      1    1 100.00%  1
live/jigsaw-te.t                       4    4 100.00%  1-4
live/validator.t           2   512     2    2 100.00%  1-2
Failed 10/36 test scripts, 72.22% okay. 23/366 subtests failed, 93.72% okay.
NMAKE : fatal error U1077: 'D:\ASPerl\bin\perl.exe' : return code '0x2'
Stop.
----------------------------------------8<----------------------------------
-----




nntp.perl.org: Perl Programming lists via nntp and http.
Comments to Ask Bjørn Hansen at ask@perl.org | Group listing | About