develooper Front page | perl.libwww | Postings from November 2001

libwww-perl-5.60

Thread Next
From:
Plato Smith
Date:
November 6, 2001 17:35
Subject:
libwww-perl-5.60
Message ID:
3BE859C9.D9F5E744@ncsu.edu
I can not resolve the following errors during the make test of
libwww-perl-5.60:

live/jigsaw-auth-b....ok
live/jigsaw-auth-d....FAILED test 1
        Failed 1/1 tests, 0.00% okay
live/jigsaw-chunk.....ok
live/jigsaw-md5.......ok
live/jigsaw-neg.......ok
live/jigsaw-te........FAILED tests 2-4
        Failed 3/4 tests, 25.00% okay
live/validator........ok
Failed Test          Stat Wstat Total Fail  Failed  List of Failed
-------------------------------------------------------------------------------

live/jigsaw-auth-d.t                1    1 100.00%  1
live/jigsaw-te.t                    4    3  75.00%  2-4
Failed 2/30 test scripts, 93.33% okay. 4/309 subtests failed, 98.71%
okay.
make: *** [test] Error 29

How can I correct these errors?

-- Plato

~~~~~~~~~~~~~~~~~~~~~~~~~~~~~~~~~~~~~~~~~~~~~~~~~~
Plato L. Smith II  ~ NCSU Libraries Fellow
North Carolina State University Libraries
D. H. Hill Library ~ Raleigh, NC 27695
Email   ~ plato_smith@ncsu.edu
Offices ~ 919-515-1355 ~ 919-515-2830
Fax     ~ 919-513-3330
~~~~~~~~~~~~~~~~~~~~~~~~~~~~~~~~~~~~~~~~~~~~~~~~~~



Thread Next


nntp.perl.org: Perl Programming lists via nntp and http.
Comments to Ask Bjørn Hansen at ask@perl.org | Group listing | About