develooper Front page | perl.libwww | Postings from August 2001

HTML Parser 3.19 - " make test" fails

Thread Next
From:
Swati B Shah
Date:
August 28, 2001 19:35
Subject:
HTML Parser 3.19 - " make test" fails
Message ID:
4A256AB7.00030B71.00@shb1ln11.transport.qld.gov.au



Trying to Install : HTML Parser 3.19
Machine type : HP-UX 11
Perl version installed : 5.6.0
ANSI C  : installed

When i m doing a make test i get the following message. How do is solve this
problem?

make test
        PERL_DL_NONLAZY=1 /usr/bin/perl -Iblib/arch -Iblib/lib
-I/opt/perl5/lib/5.6.0/PA-RISC1.1 -I/opt/perl5/lib/5.6.0 -e 'use Test::Harness
qw(&runtests $verbose); $verbose=0; runtests @ARGV;' t/*.t
t/building..........ok
t/clonei............Unrecognized identifier s in argspec at
/opt/perl5/lib/site_perl/5.6.0/PA-RISC1.1/HTML/Parser.pm line 44.
t/clonei............dubious
        Test returned status 255 (wstat 65280, 0xff00)
DIED. FAILED test 1
        Failed 1/1 tests, 0.00% okay
t/oldparse..........Unrecognized identifier s in argspec at
/opt/perl5/lib/site_perl/5.6.0/PA-RISC1.1/HTML/Parser.pm line 44.
t/oldparse..........dubious
        Test returned status 255 (wstat 65280, 0xff00)
DIED. FAILED test 1
        Failed 1/1 tests, 0.00% okay
t/parsefile.........Unrecognized identifier s in argspec at
/opt/perl5/lib/site_perl/5.6.0/PA-RISC1.1/HTML/Parser.pm line 44.
t/parsefile.........dubious
        Test returned status 255 (wstat 65280, 0xff00)
DIED. FAILED test 1
        Failed 1/1 tests, 0.00% okay
t/split.............Unrecognized identifier s in argspec at
/opt/perl5/lib/site_perl/5.6.0/PA-RISC1.1/HTML/Parser.pm line 44.
t/split.............dubious
        Test returned status 255 (wstat 65280, 0xff00)
DIED. FAILED tests 1-147
        Failed 147/147 tests, 0.00% okay
Failed Test  Status Wstat Total Fail  Failed  List of failed
-------------------------------------------------------------------------------
t/clonei.t      255 65280     1    1 100.00%  1
t/oldparse.t    255 65280     1    1 100.00%  1
t/parsefile.t   255 65280     1    1 100.00%  1
t/split.t       255 65280   147  147 100.00%  1-147
Failed 4/5 test scripts, 20.00% okay. 150/172 subtests failed, 12.79% okay.
*** Error exit code 2

Stop.


Thanks ,
Swati Shah

Unix Systems
IS Branch
Queensland Transport





************************************************************
Opinions contained in this e-mail do not necessarily reflect
the opinions of the Queensland Department of Main Roads,
Queensland Transport or National Transport Secretariat, or
endorsed organisations utilising the same infrastructure.
If you have received this electronic mail message in error,
please immediately notify the sender and delete the message
from your computer.
************************************************************

Thread Next


nntp.perl.org: Perl Programming lists via nntp and http.
Comments to Ask Bjørn Hansen at ask@perl.org | Group listing | About