develooper Front page | perl.libwww | Postings from August 2001

Re: libwww-perl-5.53 fails tests on cygwin

Thread Previous
From:
Gerrit P. Haase
Date:
August 27, 2001 09:59
Subject:
Re: libwww-perl-5.53 fails tests on cygwin
Message ID:
3B8A9762.10131.1C20833@localhost
> David Carter schrieb am 2001-05-29 11:27:

>cpan> test LWP
>Running test for module LWP
>Running make for G/GA/GAAS/libwww-perl-5.53.tar.gz
>  Is already unwrapped into directory
>/home/dcarter/.cpan/build/libwww-perl-5.53
>
>  Has already been processed within this session
>Running make test
>/usr/bin/perl -e 'use Config; chdir q{blib/script}; foreach (qw(GET HEAD
>POST))
>{' \
>-e 'unlink "$_";' \
>-e 'system("$Config{\"lns\"} lwp-request $_") && die; }'
>/usr/bin/perl t/TEST 0
>base/common-req.....ok
>base/cookies........FAILED test 29
>        Failed 1/34 tests, 97.06% okay

Have you tried with the new cygwin-perl version?

>base/date...........ok
>base/headers-auth...ok
>base/headers-etag...ok
>base/headers-util...ok
>base/headers........ok
>base/listing........ok
>base/mediatypes.....ok
>base/message........ok
>base/negotiate......ok
>base/response.......ok
>base/status.........ok
>base/ua.............ok
>html/form...........ok
>robot/rules-dbm.....      0 [main] perl 2384 handle_exceptions: Exception:
>STATU
>S_ACCESS_VIOLATION
>  11517 [main] perl 2384 stackdump: Dumping stack trace to
>perl.exe.stackdump
>robot/rules-dbm.....dubious
>        Test returned status 0 (wstat 139, 0x8b)
>        test program seems to have generated a core
>DIED. FAILED tests 1-13
>        Failed 13/13 tests, 0.00% okay
>robot/rules.........ok
>robot/ua............ok
>local/autoload......ok
>local/get...........FAILED test 1
>        Failed 1/2 tests, 50.00% okay
>local/http..........ok
>local/protosub......ok
>Failed Test       Status Wstat Total Fail  Failed  List of Failed
>----------------------------------------------------------------------------
>----
>
>base/cookies.t                        34    1   2.94%  29
>local/get.t                            2    1  50.00%  1
>robot/rules-dbm.t          0   139    13   13 100.00%  1-13
>Failed 3/22 test scripts, 86.36% okay. 15/287 subtests failed, 94.77% okay.
>make: *** [test] Error 2
>  /usr/bin/make test -- NOT OK

Gerrit


-- 
gerrit.haase@convey.de

Thread Previous


nntp.perl.org: Perl Programming lists via nntp and http.
Comments to Ask Bjørn Hansen at ask@perl.org | Group listing | About