develooper Front page | perl.libwww | Postings from March 2001

Trying to install IO::Socket::SSL

From:
Aventail Xeno
Date:
March 13, 2001 14:03
Subject:
Trying to install IO::Socket::SSL
Message ID:
3AAE99FE.633FF47@aventail.com
but I have Net::SSLeay installed and IO::Socket::SSL complains, and it
has a bunch of failures on "make test":


inux:~/shop/IO-Socket-SSL-0.77 # make test
PERL_DL_NONLAZY=1 /usr/bin/perl -Iblib/arch -Iblib/lib
-I/usr/lib/perl5/5.00503/i586-linux -I/usr/lib/perl5/5.00503 -e 'use
Test::Harness qw(&
runtests $verbose); $verbose=0; runtests @ARGV;' t/*.t
t/fh-test...........You are using Net::SSLeay!
Use of uninitialized value at blib/lib/Net/SSLeay.pm (autosplit into
blib/lib/auto/Net/SSLeay/randomize.al) line 1159.
Use of uninitialized value at blib/lib/Net/SSLeay.pm (autosplit into
blib/lib/auto/Net/SSLeay/randomize.al) line 1163.
unable to create a IO::Socket::SSL object.
FAILED tests 1-3
        Failed 3/3 tests, 0.00% okay
t/lwptest...........You are using Net::SSLeay!
Use of uninitialized value at blib/lib/Net/SSLeay.pm (autosplit into
blib/lib/auto/Net/SSLeay/randomize.al) line 1159.
Use of uninitialized value at blib/lib/Net/SSLeay.pm (autosplit into
blib/lib/auto/Net/SSLeay/randomize.al) line 1163.
trace 1 UserAgent::request
trace 2 simple_request:  GET, https://www.fortify.net/
trace 3 simple_request:  https
Use of uninitialized value at
/usr/lib/perl5/site_perl/5.005/LWP/Protocol/https.pm line 10.
trace 0 LWP::Protocol::https SSL_CLASS:
trace 1 LWP::Protocol::https SSL_CLASS usage
trace 2 Protocol::create:  LWP::Protocol::https
trace 4 simple_request:  LWP::Protocol::https
trace 5 simple_request:  GET, https://www.fortify.net/
trace 7 simple_request:  GET, https://www.fortify.net/
trace 7a simple_request:  GET, https://www.fortify.net/
trace 1 LWP::Protocol::https->_new_socket/LWP::Protocol::http
trace 8 simple_request:  GET, https://www.fortify.net/
trace 2 UserAgent::request
trace 3 UserAgent::request
trace 9 UserAgent::request
request 1: failed: 'Can't connect to www.fortify.net:443 ()'.
trace 1 UserAgent::request
trace 2 simple_request:  GET, https://www.helsinki.fi/
trace 3 simple_request:  https
trace 2 Protocol::create:  LWP::Protocol::https
trace 4 simple_request:  LWP::Protocol::https
trace 5 simple_request:  GET, https://www.helsinki.fi/
trace 7 simple_request:  GET, https://www.helsinki.fi/
trace 7a simple_request:  GET, https://www.helsinki.fi/
trace 1 LWP::Protocol::https->_new_socket/LWP::Protocol::http
trace 2 LWP::Protocol::https->_new_socket/LWP::Protocol::http
trace 8 simple_request:  GET, https://www.helsinki.fi/
trace 2 UserAgent::request
trace 3 UserAgent::request
trace 9 UserAgent::request
trace 1 UserAgent::request
trace 2 simple_request:  GET, https://www.verisign.com/
trace 3 simple_request:  https
trace 2 Protocol::create:  LWP::Protocol::https
trace 4 simple_request:  LWP::Protocol::https
trace 5 simple_request:  GET, https://www.verisign.com/
trace 7 simple_request:  GET, https://www.verisign.com/
trace 7a simple_request:  GET, https://www.verisign.com/
trace 1 LWP::Protocol::https->_new_socket/LWP::Protocol::http
trace 2 LWP::Protocol::https->_new_socket/LWP::Protocol::http
trace 8 simple_request:  GET, https://www.verisign.com/
trace 2 UserAgent::request
trace 3 UserAgent::request
trace 9 UserAgent::request
FAILED tests 1-2
        Failed 2/3 tests, 33.33% okay
t/test1.............You are using Net::SSLeay!
Use of uninitialized value at blib/lib/Net/SSLeay.pm (autosplit into
blib/lib/auto/Net/SSLeay/randomize.al) line 1159.
Use of uninitialized value at blib/lib/Net/SSLeay.pm (autosplit into
blib/lib/auto/Net/SSLeay/randomize.al) line 1163.
unable to create a IO::Socket::SSL object.
FAILED tests 1-4
        Failed 4/4 tests, 0.00% okay
Failed Test  Status Wstat Total Fail  Failed  List of failed
-------------------------------------------------------------------------------
t/fh-test.t                   3    3 100.00%  1-3
t/lwptest.t                   3    2  66.67%  1-2
t/test1.t                     4    4 100.00%  1-4
Failed 3/3 test scripts, 0.00% okay. 9/10 subtests failed, 10.00% okay.
make: *** [test_dynamic] Error 29
linux:~/shop/IO-Socket-SSL-0.77 #  

Furthermore, "make uninstall" declares itself as deprecated when I try
to use it.  Any suggestions?
-- 
Xeno Campanoli - Aspiring and self-appointed member of the Diligentsia,
	generally eschewing Dilatorian digressions and Obnoxioso expenditures.
Email:	xcampanoli@aventail.com (home home page:  http://www.aa.net/~xeno



nntp.perl.org: Perl Programming lists via nntp and http.
Comments to Ask Bjørn Hansen at ask@perl.org | Group listing | About